program: Orca
programVersion: 5.0.4
elementType: S S P O O O C C C C C C H H H H H H H H H H H H H H H
charge: 0
multiplicity: 1
keywords: wb97x-d3
keywords: def2-TZVPP
keywords: def2/J RIJCOSX
keywords: DEFGRID2
keywords: scfconv7
keywords: smallprint printgap noloewdin
keywords: NOSOSCF
formula: C6H15O3PS2
InChI: InChI=1/C6H15O3PS2/c1-4-11-5-6-12-10(7,8-2)9-3/h4-6H2,1-3H3
27 atoms
S  0.567934 1.639377 0.913702
S  -1.83886 0.485836 -1.40374
P  1.086213 -0.301303 0.402189
O  2.557223 -0.431112 1.02783
O  1.459071 -0.225966 -1.142317
O  0.1340 -1.352809 0.838824
C  -1.242547 1.537724 1.128085
C  -2.032529 1.767148 -0.144259
C  -2.87036 -0.834365 -0.700617
C  -2.710955 -2.100226 -1.520624
C  2.712954 -0.670233 2.429441
C  1.476512 -1.410217 -1.948964
H  -1.470854 2.330844 1.842029
H  -1.494603 0.595485 1.611143
H  -1.738247 2.70916 -0.608002
H  -3.090604 1.85781 0.112897
H  -2.576786 -1.015598 0.333153
H  -3.910983 -0.507216 -0.69808
H  -3.353182 -2.884506 -1.119199
H  -2.990336 -1.946454 -2.563409
H  -1.684031 -2.465587 -1.494539
H  3.779851 -0.650408 2.635967
H  2.313604 -1.64461 2.70965
H  2.224744 0.104123 3.023534
H  1.633722 -1.084882 -2.973933
H  0.530104 -1.946514 -1.891029
H  2.290239 -2.074589 -1.657341
elementType: S P O C H
totalener: -1601.27927035 hartree
nucrepener: 1197.40016332 hartree
electener: -2798.67943366 hartree
oneelecener: -4589.08982321 hartree
twoeener: 1790.41038954 hartree
cpcmener: -0.02747769 hartree
kineticenergy: 1597.03192004 hartree
xcener: -99.378905280920 hartree
chargesum: -0.0000000
charge: -0.184243 -0.165093 0.866696 -0.372462 -0.348606 -0.642354 -0.097737 -0.114341 -0.120861 -0.266826 -0.109779 -0.122613 0.134818 0.117069 0.113391 0.111321 0.092941 0.106472 0.100091 0.091934 0.086373 0.128253 0.118045 0.104445 0.130176 0.110867 0.132024
qa: -0.1842 -0.1651 0.8667 -0.3725 -0.3486 -0.6424 -0.0977 -0.1143 -0.1209 -0.2668 -0.1098 -0.1226 0.1348 0.1171 0.1134 0.1113 0.0929 0.1065 0.1001 0.0919 0.0864 0.1283 0.1180 0.1044 0.1302 0.1109 0.1320
va: 2.2786 2.1962 5.4628 2.0781 2.0492 1.9247 3.8550 3.9714 3.9724 3.9336 3.8553 3.8535 1.0044 1.0243 1.0116 1.0109 1.0067 1.0040 1.0032 1.0035 1.0041 0.9904 0.9953 0.9980 0.9874 0.9824 0.9934
dispcorr: -0.011841573 hartree
energy: -1601.291111919719
dipole: -9.45595 8.94449 -0.51146 -7.76396 7.98285 0.21889 -0.94032 1.62765 0.68733
magnitude: 0.88426 au
magnitude: 2.24762 debye
