program: Orca
programVersion: 5.0.4
elementType: S S P O O O C C C C C C H H H H H H H H H H H H H H H
charge: 0
multiplicity: 1
keywords: wb97x-d3
keywords: def2-TZVPP
keywords: def2/J RIJCOSX
keywords: DEFGRID2
keywords: scfconv7
keywords: smallprint printgap noloewdin
keywords: NOSOSCF
formula: C6H15O3PS2
InChI: InChI=1/C6H15O3PS2/c1-4-11-5-6-12-10(7,8-2)9-3/h4-6H2,1-3H3
27 atoms
S  0.859822 1.357523 0.500563
S  -3.462034 0.845705 -0.384167
P  1.501603 -0.590902 0.180305
O  2.771347 -0.677603 1.139148
O  2.152664 -0.675497 -1.267421
O  0.455588 -1.629167 0.339143
C  -0.743683 1.318835 -0.396178
C  -1.885617 0.904141 0.508007
C  -3.26049 -0.657438 -1.386408
C  -3.209031 -1.942051 -0.584205
C  2.621048 -0.795973 2.561556
C  3.208658 0.18663 -1.705667
H  -0.646403 0.674272 -1.26805
H  -0.887535 2.334899 -0.759512
H  -2.022512 1.637658 1.303154
H  -1.69132 -0.054274 0.986832
H  -4.125469 -0.658776 -2.051592
H  -2.380821 -0.557692 -2.02386
H  -2.334588 -1.983107 0.064485
H  -4.098928 -2.059466 0.033523
H  -3.150805 -2.797878 -1.258846
H  1.843297 -1.512853 2.822359
H  2.388243 0.17118 3.005783
H  3.572976 -1.147333 2.94937
H  3.010744 1.227069 -1.445942
H  3.25718 0.098525 -2.787678
H  4.161045 -0.120338 -1.276283
elementType: S P O C H
totalener: -1601.28243197 hartree
nucrepener: 1147.02298575 hartree
electener: -2748.30541772 hartree
oneelecener: -4487.33609443 hartree
twoeener: 1739.03067671 hartree
cpcmener: -0.02828035 hartree
kineticenergy: 1597.00919853 hartree
xcener: -99.373556862328 hartree
chargesum: -0.0000000
charge: -0.204177 -0.181988 0.849852 -0.351624 -0.351394 -0.639037 -0.078526 -0.151680 -0.106175 -0.253429 -0.109205 -0.101901 0.121702 0.131043 0.129786 0.107017 0.109729 0.095611 0.079733 0.080587 0.096859 0.119412 0.117883 0.129767 0.108242 0.128403 0.123510
qa: -0.2042 -0.1820 0.8499 -0.3516 -0.3514 -0.6390 -0.0785 -0.1517 -0.1062 -0.2534 -0.1092 -0.1019 0.1217 0.1310 0.1298 0.1070 0.1097 0.0956 0.0797 0.0806 0.0969 0.1194 0.1179 0.1298 0.1082 0.1284 0.1235
va: 2.2606 2.1725 5.4947 2.0851 2.0910 1.9620 3.8240 3.9711 3.9482 3.9081 3.8458 3.8328 1.0230 1.0161 1.0089 1.0229 1.0002 1.0087 1.0098 1.0154 1.0040 0.9940 0.9895 0.9906 1.0010 0.9897 0.9913
dispcorr: -0.011000164 hartree
energy: -1601.293432130502
dipole: -4.48603 6.01451 1.52848 -3.34798 4.41181 1.06383 -1.70063 1.65842 -0.04221
magnitude: 1.86273 au
magnitude: 4.73468 debye
