program: Orca
programVersion: 5.0.4
elementType: S S P O O O C C C C C C H H H H H H H H H H H H H H H
charge: 0
multiplicity: 1
keywords: wb97x-d3
keywords: def2-TZVPP
keywords: def2/J RIJCOSX
keywords: DEFGRID2
keywords: scfconv7
keywords: smallprint printgap noloewdin
keywords: NOSOSCF
formula: C6H15O3PS2
InChI: InChI=1/C6H15O3PS2/c1-4-11-5-6-12-10(7,8-2)9-3/h4-6H2,1-3H3
27 atoms
S  0.969977 1.526125 0.040307
S  -3.385596 0.677889 0.147395
P  1.402987 -0.496997 -0.181794
O  1.297093 -1.208377 1.235836
O  2.97675 -0.496636 -0.435088
O  0.548661 -1.188327 -1.175825
C  -0.813789 1.508043 -0.385247
C  -1.678504 0.913453 0.710151
C  -3.194879 -0.837864 -0.840586
C  -2.991245 -2.08973 -0.011314
C  1.991763 -0.752303 2.401135
C  3.521237 -0.029089 -1.677561
H  -0.924749 0.989816 -1.334919
H  -1.068773 2.554313 -0.551012
H  -1.71444 1.582699 1.570002
H  -1.291203 -0.039881 1.069994
H  -4.110411 -0.913101 -1.429188
H  -2.379383 -0.70326 -1.552568
H  -2.866277 -2.954618 -0.665143
H  -2.100509 -2.027189 0.614099
H  -3.846968 -2.278024 0.636016
H  3.049817 -1.004064 2.345166
H  1.54588 -1.261899 3.250861
H  1.879257 0.324046 2.539031
H  4.558325 -0.3515 -1.706148
H  3.482022 1.058559 -1.732575
H  2.991835 -0.455422 -2.529064
elementType: S P O C H
totalener: -1601.28273590 hartree
nucrepener: 1161.50766884 hartree
electener: -2762.79040474 hartree
oneelecener: -4516.31188498 hartree
twoeener: 1753.52148024 hartree
cpcmener: -0.02763536 hartree
kineticenergy: 1597.00807013 hartree
xcener: -99.373191497901 hartree
chargesum: -0.0000000
charge: -0.203717 -0.182883 0.854193 -0.348987 -0.354578 -0.642580 -0.089299 -0.135611 -0.099441 -0.262015 -0.106103 -0.112043 0.119095 0.136945 0.132236 0.097913 0.112534 0.091705 0.097001 0.080686 0.084160 0.127875 0.128589 0.107860 0.130058 0.115337 0.121071
qa: -0.2037 -0.1829 0.8542 -0.3490 -0.3546 -0.6426 -0.0893 -0.1356 -0.0994 -0.2620 -0.1061 -0.1120 0.1191 0.1369 0.1322 0.0979 0.1125 0.0917 0.0970 0.0807 0.0842 0.1279 0.1286 0.1079 0.1301 0.1153 0.1211
va: 2.2663 2.1656 5.4761 2.0787 2.0989 1.9618 3.8373 3.9548 3.9286 3.9246 3.8345 3.8493 1.0264 1.0077 1.0096 1.0213 1.0020 1.0181 1.0036 1.0062 1.0137 0.9926 0.9883 1.0005 0.9909 0.9923 0.9923
dispcorr: -0.011586801 hartree
energy: -1601.294322702373
dipole: -3.86820 5.36270 1.49450 -4.11658 4.99819 0.88162 0.79932 -0.16547 0.63386
magnitude: 1.84731 au
magnitude: 4.69549 debye
