program: Orca
programVersion: 5.0.4
elementType: S S P O O O C C C C C C H H H H H H H H H H H H H H H
charge: 0
multiplicity: 1
keywords: wb97x-d3
keywords: def2-TZVPP
keywords: def2/J RIJCOSX
keywords: DEFGRID2
keywords: scfconv7
keywords: smallprint printgap noloewdin
keywords: NOSOSCF
formula: C6H15O3PS2
InChI: InChI=1/C6H15O3PS2/c1-4-11-5-6-12-10(7,8-2)9-3/h4-6H2,1-3H3
27 atoms
S  0.726924 1.410637 1.083634
S  -3.195855 0.671237 -0.860262
P  1.581063 -0.326215 0.342713
O  3.013903 -0.361282 1.048559
O  1.982311 0.058239 -1.15106
O  0.74794 -1.542043 0.495785
C  -1.048502 1.032748 0.819989
C  -1.47846 1.202904 -0.624779
C  -2.942195 -1.120762 -1.057172
C  -4.264454 -1.852886 -0.938847
C  3.13302 -0.780215 2.412417
C  2.466099 -0.956744 -2.044033
H  -1.579832 1.734169 1.463148
H  -1.243304 0.030613 1.196941
H  -0.845596 0.638143 -1.310922
H  -1.414941 2.250551 -0.920265
H  -2.486048 -1.307328 -2.030883
H  -2.244224 -1.470208 -0.294482
H  -4.111674 -2.92189 -1.09279
H  -4.708891 -1.717652 0.047382
H  -4.984647 -1.513556 -1.684628
H  2.615089 -1.72272 2.591043
H  2.740405 -0.019887 3.089127
H  4.193297 -0.916847 2.610141
H  2.550871 -0.494119 -3.024078
H  1.773409 -1.795809 -2.106831
H  3.447482 -1.317069 -1.734293
elementType: S P O C H
totalener: -1601.28896514 hartree
nucrepener: 1138.84777786 hartree
electener: -2740.13674300 hartree
oneelecener: -4470.93024677 hartree
twoeener: 1730.79350378 hartree
cpcmener: -0.02117346 hartree
kineticenergy: 1597.00471664 hartree
xcener: -99.366363691056 hartree
chargesum: -0.0000000
charge: -0.188077 -0.177685 0.846963 -0.358633 -0.352016 -0.617462 -0.103464 -0.112878 -0.110637 -0.254807 -0.108584 -0.117945 0.131010 0.120092 0.099033 0.126092 0.096829 0.090342 0.093999 0.086087 0.088504 0.116759 0.109855 0.127203 0.127484 0.116579 0.125359
qa: -0.1881 -0.1777 0.8470 -0.3586 -0.3520 -0.6175 -0.1035 -0.1129 -0.1106 -0.2548 -0.1086 -0.1179 0.1310 0.1201 0.0990 0.1261 0.0968 0.0903 0.0940 0.0861 0.0885 0.1168 0.1099 0.1272 0.1275 0.1166 0.1254
va: 2.2801 2.1783 5.4900 2.0962 2.0715 1.9764 3.8700 3.9339 3.9868 3.9325 3.8516 3.8415 1.0103 1.0286 1.0283 1.0113 1.0027 1.0063 1.0024 1.0095 1.0039 0.9959 0.9935 0.9903 0.9886 0.9966 0.9912
dispcorr: -0.010380463 hartree
energy: -1601.299345604627
dipole: -7.49192 8.46106 0.96914 -8.93125 8.60938 -0.32187 -3.51825 3.52270 0.00445
magnitude: 1.02121 au
magnitude: 2.59570 debye
