program: Orca
programVersion: 5.0.4
elementType: S S P O O O C C C C C C H H H H H H H H H H H H H H H
charge: 0
multiplicity: 1
keywords: wb97x-d3
keywords: def2-TZVPP
keywords: def2/J RIJCOSX
keywords: DEFGRID2
keywords: scfconv7
keywords: smallprint printgap noloewdin
keywords: NOSOSCF
formula: C6H15O3PS2
InChI: InChI=1/C6H15O3PS2/c1-4-11-5-6-12-10(7,8-2)9-3/h4-6H2,1-3H3
27 atoms
S  0.359746 1.345963 0.034598
S  -3.050499 0.348339 -0.356681
P  1.477553 -0.291232 0.678626
O  2.948073 0.066241 0.171857
O  1.127057 -1.54463 -0.236712
O  1.297196 -0.60316 2.11232
C  -0.979095 1.343454 1.279189
C  -2.014822 0.249231 1.125558
C  -2.12191 -0.630669 -1.578191
C  -3.054007 -1.074203 -2.690282
C  3.693828 1.126672 0.780175
C  1.347502 -1.558528 -1.649288
H  -1.442175 2.324975 1.17473
H  -0.527944 1.302941 2.270299
H  -2.701367 0.333045 1.971839
H  -1.567859 -0.744274 1.193222
H  -1.302918 -0.037887 -1.98167
H  -1.694417 -1.497433 -1.072185
H  -3.520623 -0.225182 -3.192068
H  -2.491766 -1.628051 -3.443686
H  -3.84564 -1.723827 -2.316704
H  3.719724 1.02452 1.865371
H  3.275852 2.099537 0.519388
H  4.707961 1.060522 0.394198
H  2.404764 -1.696965 -1.874327
H  0.994829 -0.643407 -2.128381
H  0.787124 -2.399484 -2.050235
elementType: S P O C H
totalener: -1601.28682736 hartree
nucrepener: 1173.87867482 hartree
electener: -2775.16550218 hartree
oneelecener: -4540.67614861 hartree
twoeener: 1765.51064643 hartree
cpcmener: -0.02386039 hartree
kineticenergy: 1597.00873940 hartree
xcener: -99.372386727973 hartree
chargesum: 0.0000000
charge: -0.200747 -0.175970 0.839972 -0.346700 -0.344825 -0.615087 -0.086809 -0.122571 -0.113815 -0.249927 -0.115141 -0.134713 0.119989 0.123173 0.127640 0.101811 0.083986 0.095255 0.089750 0.091701 0.088024 0.120727 0.113899 0.127253 0.135751 0.115583 0.131792
qa: -0.2007 -0.1760 0.8400 -0.3467 -0.3448 -0.6151 -0.0868 -0.1226 -0.1138 -0.2499 -0.1151 -0.1347 0.1200 0.1232 0.1276 0.1018 0.0840 0.0953 0.0897 0.0917 0.0880 0.1207 0.1139 0.1273 0.1358 0.1156 0.1318
va: 2.2657 2.1691 5.5012 2.0931 2.0742 2.0015 3.8690 3.9348 3.9938 3.9366 3.8532 3.8447 1.0131 1.0300 1.0039 1.0246 1.0083 0.9995 1.0026 1.0030 1.0119 0.9923 0.9940 0.9910 0.9970 0.9889 0.9846
dispcorr: -0.011808805 hartree
energy: -1601.298636160381
dipole: -4.43477 5.25522 0.82045 -2.29006 2.84428 0.55422 -8.80884 7.44713 -1.36171
magnitude: 1.68361 au
magnitude: 4.27940 debye
