program: Orca
programVersion: 5.0.4
elementType: S S P O O O C C C C C C H H H H H H H H H H H H H H H
charge: 0
multiplicity: 1
keywords: wb97x-d3
keywords: def2-TZVPP
keywords: def2/J RIJCOSX
keywords: DEFGRID2
keywords: scfconv7
keywords: smallprint printgap noloewdin
keywords: NOSOSCF
formula: C6H15O3PS2
InChI: InChI=1/C6H15O3PS2/c1-4-11-5-6-12-10(7,8-2)9-3/h4-6H2,1-3H3
27 atoms
S  0.549867 1.676017 0.633686
S  -1.826781 0.352896 -1.528557
P  0.95135 -0.34665 0.870824
O  2.443956 -0.17211 1.425813
O  1.110505 -1.069759 -0.543426
O  0.01364 -1.112456 1.72127
C  -1.263819 1.750079 0.839817
C  -2.032551 1.795953 -0.466752
C  -2.758888 -0.907349 -0.605514
C  -2.548133 -2.262603 -1.253685
C  3.242046 -1.338702 1.67271
C  1.79274 -0.455975 -1.634832
H  -1.442605 2.673187 1.394583
H  -1.585412 0.932419 1.483364
H  -1.719643 2.656703 -1.059733
H  -3.092568 1.939763 -0.241008
H  -2.418046 -0.934065 0.429021
H  -3.816872 -0.638945 -0.603502
H  -3.133192 -3.01969 -0.730395
H  -2.862023 -2.26774 -2.298212
H  -1.500588 -2.56212 -1.210889
H  3.46368 -1.876183 0.74985
H  2.748743 -2.013136 2.374041
H  4.174004 -0.993097 2.112796
H  2.781687 -0.091198 -1.350425
H  1.206794 0.368652 -2.040375
H  1.910689 -1.217166 -2.403068
elementType: S P O C H
totalener: -1601.28618471 hartree
nucrepener: 1197.84178591 hartree
electener: -2799.12797062 hartree
oneelecener: -4589.47958392 hartree
twoeener: 1790.35161329 hartree
cpcmener: -0.02424111 hartree
kineticenergy: 1597.01550508 hartree
xcener: -99.374233379366 hartree
chargesum: 0.0000000
charge: -0.178848 -0.163675 0.843387 -0.360084 -0.335994 -0.621065 -0.108468 -0.122172 -0.125221 -0.257461 -0.129195 -0.126084 0.132846 0.120821 0.115367 0.109473 0.094096 0.105955 0.094887 0.089383 0.085822 0.120255 0.121490 0.126755 0.129557 0.107495 0.130681
qa: -0.1788 -0.1637 0.8434 -0.3601 -0.3360 -0.6211 -0.1085 -0.1222 -0.1252 -0.2575 -0.1292 -0.1261 0.1328 0.1208 0.1154 0.1095 0.0941 0.1060 0.0949 0.0894 0.0858 0.1203 0.1215 0.1268 0.1296 0.1075 0.1307
va: 2.2656 2.1885 5.4852 2.0870 2.0402 1.9987 3.8493 3.9750 3.9621 3.9282 3.8665 3.8376 1.0073 1.0221 1.0073 1.0113 1.0141 1.0055 1.0029 1.0047 1.0130 0.9871 0.9936 0.9881 0.9885 1.0034 0.9889
dispcorr: -0.012193607 hartree
energy: -1601.298378320143
dipole: -5.57167 5.99696 0.42529 -5.96254 6.56261 0.60007 -4.99112 4.37558 -0.61554
magnitude: 0.95908 au
magnitude: 2.43779 debye
