program: Orca
programVersion: 5.0.4
elementType: S S P O O O C C C C C C H H H H H H H H H H H H H H H
charge: 0
multiplicity: 1
keywords: wb97x-d3
keywords: def2-TZVPP
keywords: def2/J RIJCOSX
keywords: DEFGRID2
keywords: scfconv7
keywords: smallprint printgap noloewdin
keywords: NOSOSCF
formula: C6H15O3PS2
InChI: InChI=1/C6H15O3PS2/c1-4-11-5-6-12-10(7,8-2)9-3/h4-6H2,1-3H3
27 atoms
S  0.708572 1.50149 0.089082
S  -2.389978 0.196584 0.900417
P  1.276728 -0.448037 -0.388734
O  1.762954 -1.048722 1.007052
O  2.662617 -0.349135 -1.166751
O  0.295755 -1.227849 -1.169904
C  -0.834763 1.739552 -0.859129
C  -2.06034 1.746238 0.034763
C  -3.089262 -0.806358 -0.444709
C  -3.138412 -2.262234 -0.023378
C  0.84895 -1.320913 2.072061
C  3.795679 0.356909 -0.662172
H  -0.90226 0.989051 -1.64462
H  -0.736633 2.709795 -1.34829
H  -2.930444 2.017384 -0.568759
H  -1.965319 2.516063 0.802332
H  -4.088922 -0.439482 -0.682456
H  -2.473523 -0.696948 -1.336903
H  -3.723853 -2.403285 0.88612
H  -3.600825 -2.862306 -0.807803
H  -2.137932 -2.657432 0.15196
H  0.062853 -2.005958 1.755778
H  0.395571 -0.403793 2.446307
H  1.426892 -1.786498 2.866955
H  4.213952 -0.136978 0.214766
H  3.548196 1.390899 -0.412891
H  4.540956 0.363429 -1.454061
elementType: S P O C H
totalener: -1601.28562640 hartree
nucrepener: 1185.67980823 hartree
electener: -2786.96543463 hartree
oneelecener: -4565.11352042 hartree
twoeener: 1778.14808579 hartree
cpcmener: -0.02266796 hartree
kineticenergy: 1597.02232394 hartree
xcener: -99.376901793028 hartree
chargesum: -0.0000000
charge: -0.214182 -0.162745 0.838939 -0.340511 -0.349419 -0.605343 -0.079373 -0.126184 -0.121143 -0.259450 -0.107961 -0.109288 0.111364 0.129672 0.111481 0.114034 0.103688 0.095531 0.090807 0.095905 0.081483 0.113338 0.106242 0.131211 0.120676 0.106006 0.125220
qa: -0.2142 -0.1627 0.8389 -0.3405 -0.3494 -0.6053 -0.0794 -0.1262 -0.1211 -0.2595 -0.1080 -0.1093 0.1114 0.1297 0.1115 0.1140 0.1037 0.0955 0.0908 0.0959 0.0815 0.1133 0.1062 0.1312 0.1207 0.1060 0.1252
va: 2.2455 2.1860 5.5103 2.0804 2.1115 1.9999 3.8422 3.9853 3.9750 3.9365 3.8619 3.8547 1.0298 1.0097 1.0105 1.0087 1.0050 1.0054 1.0021 1.0038 1.0132 0.9868 0.9981 0.9927 0.9918 0.9954 0.9894
dispcorr: -0.011765757 hartree
energy: -1601.297392160096
dipole: -8.81600 8.89694 0.08094 -2.22870 3.59564 1.36694 1.07396 -0.58219 0.49177
magnitude: 1.45496 au
magnitude: 3.69822 debye
