program: Orca
programVersion: 5.0.4
elementType: S S P O O O C C C C C C H H H H H H H H H H H H H H H
charge: 0
multiplicity: 1
keywords: wb97x-d3
keywords: def2-TZVPP
keywords: def2/J RIJCOSX
keywords: DEFGRID2
keywords: scfconv7
keywords: smallprint printgap noloewdin
keywords: NOSOSCF
formula: C6H15O3PS2
InChI: InChI=1/C6H15O3PS2/c1-4-11-5-6-12-10(7,8-2)9-3/h4-6H2,1-3H3
27 atoms
S  0.84982 1.629478 -0.52158
S  -3.491802 0.739569 -0.168113
P  1.459127 -0.347336 -0.400592
O  1.47661 -0.60644 1.177347
O  2.971332 -0.284337 -0.895825
O  0.69429 -1.339467 -1.188113
C  -0.854473 1.481253 0.145581
C  -1.841596 0.968258 -0.883368
C  -3.24759 -0.744565 0.855016
C  -2.977626 -2.013847 0.071473
C  1.393744 -1.939497 1.703965
C  3.995509 0.481433 -0.254926
H  -1.116266 2.490168 0.463722
H  -0.82165 0.860496 1.039648
H  -1.504362 0.03991 -1.339998
H  -1.959909 1.693674 -1.689485
H  -2.458758 -0.562135 1.587338
H  -4.175313 -0.838317 1.423045
H  -2.047435 -1.959749 -0.492198
H  -2.890281 -2.860383 0.755049
H  -3.785744 -2.22889 -0.626938
H  2.257695 -2.537934 1.413866
H  0.480337 -2.437198 1.381426
H  1.379029 -1.841491 2.786831
H  4.944153 0.137278 -0.66049
H  3.999874 0.33335 0.824907
H  3.886434 1.543925 -0.474884
elementType: S P O C H
totalener: -1601.28740269 hartree
nucrepener: 1155.92761146 hartree
electener: -2757.21501415 hartree
oneelecener: -4504.82527107 hartree
twoeener: 1747.61025692 hartree
cpcmener: -0.02528473 hartree
kineticenergy: 1596.99967342 hartree
xcener: -99.369332371827 hartree
chargesum: 0.0000000
charge: -0.193043 -0.177217 0.829392 -0.352083 -0.351655 -0.614584 -0.094417 -0.145608 -0.106311 -0.254727 -0.109583 -0.113673 0.130539 0.120995 0.109953 0.127383 0.091883 0.109257 0.076604 0.094792 0.086057 0.129948 0.115154 0.126934 0.127446 0.121659 0.114904
qa: -0.1930 -0.1772 0.8294 -0.3521 -0.3517 -0.6146 -0.0944 -0.1456 -0.1063 -0.2547 -0.1096 -0.1137 0.1305 0.1210 0.1100 0.1274 0.0919 0.1093 0.0766 0.0948 0.0861 0.1299 0.1152 0.1269 0.1274 0.1217 0.1149
va: 2.2733 2.1753 5.5123 2.0362 2.1027 1.9858 3.8561 3.9439 3.9496 3.8985 3.8378 3.8579 1.0122 1.0265 1.0292 1.0102 1.0088 1.0000 1.0157 1.0044 1.0164 0.9887 0.9923 0.9903 0.9912 0.9901 0.9868
dispcorr: -0.011702738 hartree
energy: -1601.299105430376
dipole: -4.52747 5.71253 1.18507 -7.45679 7.60077 0.14398 7.67100 -5.62874 2.04226
magnitude: 2.36557 au
magnitude: 6.01281 debye
