program: Gaussian 09
title: 000065396
version: EM64L-G09RevD.01
frameworkgroup: C1[X(C10H23N3O3)]
method: RPBEPBE
basis: SDD
operation: Freq
keyword: #p
keyword: freq=noraman
keyword: PBEPBE/SDD
title: #p freq=noraman PBEPBE/SDD
converged: YES YES NO NO
title: Mulliken charges:
elementType: O O O N N N C C C C C C C C C C H H H H H H H H H H H H H H H H H H H H H H H
charge: -0.442037 -0.412336 -0.243413 -0.271991 -0.651487 -0.571506 -0.388352 -0.357684 -0.378553 -0.363511 -0.112146 -0.372168 -0.387348 -0.170088 -0.390507 0.147489 0.178852 0.214510 0.224026 0.194282 0.202765 0.176985 0.218480 0.203899 0.226559 0.211510 0.162349 0.262361 0.176448 0.223933 0.249420 0.207860 0.206985 0.320892 0.314266 0.277429 0.255748 0.275415 0.380662
chargesum: 0.00000
title: Mulliken charges with hydrogens summed into heavy atoms:
elementType: O O O N N N C C C C C C C C C C
charge: -0.121144 -0.031674 -0.243413 -0.009630 -0.059791 -0.040342 0.005011 0.060624 0.001197 0.058869 0.114413 0.001690 0.013033 0.079332 0.024338 0.147489
polarizability: 1.71788007e+02 -3.45524081e-01 1.26221291e+02 -2.68128769e+00 -3.97117622e-01 1.25694489e+02
1716.lowfreq: -7.2397 -3.7851 -0.0002 0.0007 0.0010 1.6130 17.8685 23.5906 30.8980
frequency: 17.7841 23.4038 30.7581 41.8389 50.7752 73.3155 81.3722 97.5632 99.0199 120.4094 134.5824 155.6841 169.2807 175.4661 206.5575 216.7170 243.6325 266.4946 305.1498 326.6307 337.3746 369.9880 399.4404 422.8715 459.8571 476.9528 492.8492 529.9406 567.4059 575.3625 622.4659 630.3578 716.2572 720.8546 740.1119 776.6557 782.4193 805.6287 828.3157 898.0477 933.0618 940.7209 962.1749 1009.8124 1020.1961 1040.3493 1045.3632 1053.3763 1068.2263 1078.7546 1087.5167 1098.4327 1106.3825 1121.1273 1143.3875 1157.0385 1165.1784 1189.8909 1203.1474 1213.3094 1231.1731 1251.7923 1254.7573 1265.3496 1272.9191 1281.3195 1284.1885 1290.9025 1304.0146 1320.0015 1334.3885 1352.0493 1364.1638 1374.0150 1381.0008 1388.6058 1390.5206 1452.4280 1453.8308 1454.7146 1466.4398 1472.8939 1479.8154 1494.5946 1496.0170 1604.9334 1639.4361 1662.8226 2794.8485 2833.1843 2901.0559 2911.5618 2945.1449 2954.7359 2964.3416 2983.0917 2987.3898 2993.7221 3014.7519 3015.2042 3037.1738 3037.6027 3055.8711 3057.7080 3423.6836 3448.1757 3502.5692 3518.4414 3525.4918 3575.3349 3648.0985
redmass: 3.9840 3.9308 5.3048 6.1971 4.7844 2.6057 2.4916 2.1930 2.5569 3.3167 3.2280 2.2700 2.1129 1.3306 2.3436 1.6040 2.6495 3.8894 4.0334 2.0039 1.6906 2.3251 3.6406 3.2225 2.9961 1.6087 2.3087 2.0793 3.1703 2.7523 1.3417 1.5128 3.8473 1.3379 1.1009 1.4304 1.4542 2.4320 2.3955 1.6324 1.6463 1.9224 1.9938 2.2453 2.5192 2.6513 2.8021 2.2944 2.4332 1.5277 2.2568 3.0268 1.6524 1.7507 1.5250 1.3297 3.0462 2.1282 1.3552 1.4899 1.3977 1.3221 1.3392 1.4805 1.3855 1.0778 1.2329 1.2088 1.2260 1.2987 1.3929 1.5090 1.5592 1.1615 1.8291 1.5606 1.4414 1.1118 1.1716 1.1023 1.0686 1.0877 1.0932 1.0846 1.0908 1.3625 1.0935 3.4815 1.0716 1.0713 1.0807 1.0693 1.0669 1.0640 1.0633 1.0814 1.0618 1.0846 1.0955 1.0879 1.1005 1.0924 1.0906 1.1031 1.0739 1.0449 1.0461 1.0641 1.0655 1.0972 1.0995
irintensity: 0.3021 1.7901 1.0002 1.4789 0.1362 2.2660 3.0811 1.0313 2.2281 2.6784 4.4848 1.9963 11.4933 23.6050 6.7506 31.7002 22.2579 7.8673 1.2699 86.2678 49.5431 39.6877 14.2580 13.2960 8.2261 124.1156 90.6052 30.1347 12.3819 69.4015 185.6814 190.4147 23.3215 89.1355 17.6365 0.9558 5.8543 6.0328 26.3152 0.8647 4.6002 1.2894 12.0032 18.3656 0.7826 73.8219 16.5445 205.5348 4.3831 24.0120 11.7890 4.0089 5.6313 25.3342 16.2025 33.5810 24.1342 12.9473 21.3870 16.1420 5.5725 1.0169 1.4658 3.5700 12.8080 0.1737 0.3177 6.4603 3.0016 15.6162 3.2665 1.2635 0.9342 21.1809 5.1091 14.2493 10.4924 33.6105 31.4299 3.5450 2.8792 9.2480 3.8273 3.3591 5.7408 181.6989 39.1379 128.2660 110.7998 127.4826 50.2660 71.6176 29.7826 3.3543 24.9559 23.9776 79.7792 34.1976 6.1721 23.0117 14.4892 25.9344 52.5699 88.5654 5.8214 1.9205 13.1409 26.7624 3.1096 0.0785 17.6528
temp: 298.150 k
press: 1.00000 atm
elementType: 8 8 8 7 7 7 6 6 6 6 6 6 6 6 6 6 1 1 1 1 1 1 1 1 1 1 1 1 1 1 1 1 1 1 1 1 1 1 1
symmnumber: 1
zpe: 883892.6 jmol-1
zpe.correction: 0.336657 hartree
zpe.thermalcorrener: 0.357303 hartree
zpe.thermalcorrenthalpy: 0.358247 hartree
zpe.thermalcorrgfe: 0.283977 hartree
zpe.sumelectzpe: -783.430429 hartree
zpe.sumelectthermal: -783.409783 hartree
zpe.sumelectthermalent: -783.408839 hartree
zpe.sumelectthermalfe: -783.483109 hartree
dipole: 0.1133 1.1444 0.6503
dipole: 1.3211
quadrupole: -81.7181 -95.0893 -101.7846
quadrupole: 0.7689 13.9524 7.2766
quadrupole: 11.1459 -2.2253 -8.9206 0.7689 13.9524 7.2766
hfenergy: -783.7670859 hartree
pointgroup: C01 [X(C10H23N3O3)]
dipole: -0.0454848 -0.3946559 0.3351776 debye
polarizability: 171.8255706|-0.2386836|126.348505|2.3505338|0.2521835|125.5297114 unknown
InChI: InChI=1S/C10H23N3O3/c11-5-4-8(14)7-13-6-2-1-3-9(12)10(15)16/h8-9,13-15H,1-7,11-12H2
charge 0 multiplicity 1
39 atoms
O  -4.035689 -1.583077 0.171217
O  5.213127 1.187332 -1.327143
O  5.623678 1.298459 0.953309
N  -1.546379 -0.207748 -0.304363
N  4.881451 -1.328082 1.335041
N  -7.723518 0.815176 0.327338
C  0.904102 -0.594341 -0.507447
C  2.309659 -0.235584 0.021559
C  -0.21836 0.185153 0.205003
C  3.428195 -1.011419 -0.700798
C  -4.008702 -0.131899 -0.170239
C  -2.684906 0.487579 0.316001
C  -5.253052 0.59606 0.369118
C  4.834924 -0.832512 -0.041608
C  -6.569547 0.101771 -0.264208
C  5.259488 0.634372 -0.043402
H  0.732302 -1.68405 -0.372811
H  0.834459 -0.396652 -1.594981
H  2.378098 -0.456138 1.104672
H  2.476768 0.85546 -0.098229
H  -0.083927 1.2711 0.022349
H  -0.119503 0.038148 1.312918
H  3.490752 -0.707415 -1.763046
H  3.199896 -2.095658 -0.677382
H  -4.008756 -0.143351 -1.274939
H  -2.657344 1.558592 0.031058
H  -2.665798 0.454467 1.441073
H  -1.694492 -1.227282 -0.269484
H  -5.298989 0.471602 1.474273
H  -5.163198 1.683159 0.181124
H  5.566732 -1.348254 -0.708008
H  -6.617344 -1.008154 -0.171343
H  -6.549144 0.330815 -1.347058
H  -4.117037 -1.658501 1.158186
H  5.312853 -0.695243 2.012271
H  5.103486 -2.315511 1.450812
H  -7.84981 0.63252 1.328874
H  -8.600224 0.694752 -0.189501
H  5.502848 2.138553 -1.283008
