program: Gaussian 09
title: 000065422
version: EM64L-G09RevD.01
frameworkgroup: C1[X(C18H20N2O4)]
method: RPBEPBE
basis: SDD
operation: Freq
keyword: #p
keyword: freq=noraman
keyword: PBEPBE/SDD
title: #p freq=noraman PBEPBE/SDD
converged: YES YES NO NO
title: Mulliken charges:
elementType: O O O O N N C C C C C C C C C C C C C C C C C C H H H H H H H H H H H H H H H H H H H H
charge: -0.257946 -0.249365 -0.435660 -0.450682 -0.214605 -0.409558 0.207161 0.153585 0.284565 0.146611 0.285287 0.045058 -0.340976 0.038660 -0.411272 -0.418618 -0.391198 -0.372886 -0.402212 -0.266241 -0.351602 -0.448760 -0.326774 -0.302828 0.244467 0.238025 0.272763 0.248041 0.200498 0.281332 0.241710 0.224358 0.307750 0.235815 0.240335 0.214588 0.241510 0.223271 0.186463 0.221339 0.191763 0.196703 0.330631 0.348893
chargesum: 0.00000
title: Mulliken charges with hydrogens summed into heavy atoms:
elementType: O O O O N N C C C C C C C C C C C C C C C C C C
charge: -0.257946 -0.249365 -0.105029 -0.101789 -0.214605 -0.101808 0.207161 0.153585 0.284565 0.146611 0.285287 0.045058 0.141516 0.038660 -0.138509 -0.170577 -0.190700 -0.091554 0.063856 -0.030426 0.103321 0.016021 0.081028 0.085639
polarizability: 3.70403235e+02 5.49531427e+00 2.47509317e+02 -2.28480961e+01 6.20099425e+00 1.25870307e+02
1716.lowfreq: -6.9767 -2.3857 -0.0007 -0.0005 -0.0005 6.3025 17.7864 26.8272 38.1348
frequency: 17.7633 26.2700 38.1126 40.7844 55.0558 66.5819 72.4853 94.1007 113.0315 121.0932 124.9090 151.4688 173.1990 197.6615 210.0573 245.6556 268.0754 276.0213 289.0768 302.0227 318.5072 329.8271 340.0782 365.7591 373.6526 403.8457 410.7394 441.5781 452.3684 470.3305 481.5877 492.6138 504.4806 548.0909 580.9153 598.9730 646.0027 652.4503 676.6279 716.4282 744.0825 754.8472 770.0779 779.1808 794.3363 818.9666 822.7812 837.0925 850.7222 874.7074 889.3032 932.1304 932.7398 959.6387 976.6739 987.0077 991.8449 995.6957 1024.1498 1044.3743 1054.3461 1060.2814 1065.1755 1081.8074 1096.5061 1107.8553 1132.0435 1159.1130 1189.1587 1190.6885 1193.5722 1209.7388 1222.5129 1231.3846 1253.6472 1257.9124 1266.5879 1284.8044 1292.4545 1315.3663 1326.1460 1334.1390 1337.5598 1347.9911 1353.9179 1370.6071 1386.2069 1387.4796 1392.9739 1418.3333 1420.2133 1442.0539 1447.4341 1457.8626 1467.1414 1468.7953 1482.8349 1488.0730 1491.6166 1502.0214 1544.3182 1561.2495 1573.7699 1589.5010 1608.4003 1627.9085 2933.4701 2948.9959 2949.5999 2980.1601 2990.1898 2990.8957 3008.0965 3034.1464 3053.0457 3071.2651 3076.2190 3104.0276 3116.1878 3150.8569 3151.2185 3169.6480 3175.3101 3557.5810 3568.5399 3573.2016
redmass: 5.8853 6.3288 5.5512 6.0446 3.2178 2.5678 2.1231 5.1359 3.7384 5.8464 3.1602 3.7195 4.9954 4.1767 3.8112 3.1480 3.6732 3.0164 1.1069 3.8396 2.2993 1.7996 3.6453 3.3853 7.2293 3.1101 1.9459 4.0783 4.9939 4.0461 5.9123 4.7725 4.2638 6.1221 4.2212 5.6427 4.8467 6.0347 5.1527 3.5685 5.9550 1.3604 2.1326 2.7405 1.7790 1.9330 3.2861 1.5572 2.4114 1.8430 2.3841 1.6732 2.1227 3.9573 3.9620 1.4172 3.0745 1.3750 4.1219 3.1969 2.8640 2.2920 2.3541 1.8430 2.3117 1.5339 1.9145 1.8942 1.3172 1.2660 1.7273 1.3018 2.0841 2.1968 2.4206 1.2648 1.3907 1.1859 1.1028 1.7342 1.9914 1.3541 1.4158 1.5766 1.8179 2.1679 1.6581 1.2692 2.7272 1.4858 4.7361 1.2540 1.9904 2.7821 1.0799 1.1847 1.0908 1.0858 1.0922 2.7526 4.5787 7.0802 6.0663 7.2044 7.7189 7.4517 1.0552 1.0596 1.0688 1.1044 1.0892 1.0614 1.0782 1.0594 1.0945 1.1003 1.0997 1.1059 1.0876 1.0906 1.0889 1.0978 1.0942 1.0661 1.0760 1.0666
irintensity: 0.1421 0.3242 2.6143 0.4098 5.9432 6.3096 3.3424 3.2837 3.8574 4.7095 1.7306 5.0287 1.5546 1.7360 4.1161 2.2565 7.3094 1.5190 162.6967 33.9421 58.8055 98.0459 4.5896 13.2394 26.1844 33.1375 59.6349 23.9013 9.0113 0.8457 28.4156 2.5505 10.7131 0.5665 20.3035 6.1289 2.0901 3.2653 9.1172 0.6841 1.5219 10.9827 83.4997 7.4480 0.1256 9.1281 5.6161 31.2166 4.0789 2.4694 15.0999 4.7320 2.2556 98.0664 41.4600 7.0992 80.3175 1.3595 14.4272 16.7183 16.5722 33.5787 34.5952 8.3991 2.4878 39.3977 67.8089 4.1377 6.3585 18.4816 11.3070 12.2974 4.2457 11.7142 83.3578 25.1576 26.2260 9.4065 1.8272 29.8207 149.9634 12.2388 16.4352 68.5691 67.2984 121.5264 141.9786 24.5156 60.5617 4.5032 60.8963 91.7128 3.0763 16.0861 3.3838 53.9355 9.0339 4.8440 71.6926 28.8966 283.6975 246.9363 34.3238 629.4685 64.0444 51.3406 82.1915 49.0467 68.2722 56.3576 3.8730 14.6007 56.2286 26.4797 10.2715 42.6422 28.7368 6.8563 12.6576 10.0980 2.0503 13.3298 19.0905 9.1656 46.7567 6.5529
temp: 298.150 k
press: 1.00000 atm
elementType: 8 8 8 8 7 7 6 6 6 6 6 6 6 6 6 6 6 6 6 6 6 6 6 6 1 1 1 1 1 1 1 1 1 1 1 1 1 1 1 1 1 1 1 1
symmnumber: 1
zpe: 924502.8 jmol-1
zpe.correction: 0.352125 hartree
zpe.thermalcorrener: 0.374986 hartree
zpe.thermalcorrenthalpy: 0.375931 hartree
zpe.thermalcorrgfe: 0.297641 hartree
zpe.sumelectzpe: -1106.598343 hartree
zpe.sumelectthermal: -1106.575481 hartree
zpe.sumelectthermalent: -1106.574537 hartree
zpe.sumelectthermalfe: -1106.652827 hartree
dipole: -9.4975 -0.3966 -0.7456
dipole: 9.5350
quadrupole: -154.6148 -137.9922 -141.2150
quadrupole: -7.3802 3.6731 -3.0942
quadrupole: -10.0075 6.6151 3.3924 -7.3802 3.6731 -3.0942
hfenergy: -1106.9504676 hartree
pointgroup: C01 [X(C18H20N2O4)]
dipole: -3.7365791 -0.1269027 -0.3074101 debye
polarizability: 370.6707893|4.2002831|247.5371705|-21.8355486|5.2305996|125.5749002 unknown
InChI: InChI=1S/C18H20N2O4/c21-10-2-8-19-15-7-6-14-16-12(15)4-1-5-13(16)17(23)20(18(14)24)9-3-11-22/h1,4-7,19,21-22H,2-3,8-11H2
charge 0 multiplicity 1
44 atoms
O  2.459853 -2.273009 -0.737978
O  3.168693 2.333678 -0.404434
O  7.256055 -1.104008 1.387502
O  -7.909186 0.243934 -0.28328
N  2.790953 0.035249 -0.589675
N  -3.637769 -0.354578 0.460871
C  0.007201 0.427301 -0.078274
C  0.520129 -0.892642 -0.292103
C  -1.398566 0.637982 0.175436
C  0.893088 1.553303 -0.116755
C  -2.286472 -0.521612 0.219898
C  1.952499 -1.122512 -0.550977
C  4.23923 -0.182143 -0.841651
C  2.348457 1.364955 -0.372945
C  -0.362983 -1.987103 -0.247569
C  -1.739066 -1.814001 0.004322
C  -1.858017 1.976714 0.370409
C  0.407211 2.854312 0.087922
C  5.009306 -0.514462 0.456338
C  -0.97451 3.065944 0.329803
C  -4.608228 -1.457262 0.553506
C  -6.044727 -0.916934 0.679961
C  6.501168 -0.76559 0.170112
C  -6.555658 -0.235727 -0.596605
H  4.631932 0.744157 -1.292408
H  4.324992 -1.017861 -1.556941
H  0.051235 -2.987868 -0.409769
H  -2.385631 -2.693923 0.043746
H  -2.918975 2.188539 0.550966
H  1.117966 3.686063 0.052592
H  4.914426 0.319256 1.175525
H  4.562768 -1.419076 0.914453
H  -3.97881 0.569486 0.722903
H  -1.352435 4.081693 0.482866
H  -4.375116 -2.102282 1.42706
H  -4.526119 -2.096002 -0.34975
H  -6.72367 -1.753606 0.923579
H  -6.114408 -0.200481 1.522348
H  6.615875 -1.562595 -0.597238
H  6.988586 0.150805 -0.20417
H  -5.893123 0.607823 -0.889353
H  -6.570102 -0.967269 -1.433606
H  6.859537 -1.919247 1.787562
H  -8.30849 0.6701 -1.082598
