program: Orca
programVersion: 5.0.4
elementType: S S P O O O C C C C C C H H H H H H H H H H H H H H H
charge: 0
multiplicity: 1
keywords: wb97x-d3
keywords: def2-TZVPP
keywords: def2/J RIJCOSX
keywords: DEFGRID2
keywords: scfconv7
keywords: smallprint printgap noloewdin
keywords: NOSOSCF
formula: C6H15O3PS2
InChI: InChI=1/C6H15O3PS2/c1-4-11-5-6-12-10(7,8-2)9-3/h4-6H2,1-3H3
27 atoms
S  0.392119 -1.652368 -0.117022
S  -2.913898 1.318477 0.11094
P  2.088185 -0.522461 0.206981
O  1.975475 -0.112591 1.740898
O  1.909784 0.901791 -0.500666
O  3.283056 -1.290443 -0.210228
C  -0.977343 -0.60047 0.507274
C  -1.460537 0.421267 -0.501901
C  -4.236488 0.102987 -0.172682
C  -4.623395 -0.057583 -1.629192
C  2.9339 0.7829 2.325758
C  2.034126 1.019782 -1.920322
H  -0.679055 -0.13332 1.443732
H  -1.761529 -1.321431 0.740626
H  -1.686479 -0.043855 -1.462563
H  -0.699364 1.179809 -0.68227
H  -3.951994 -0.853813 0.268855
H  -5.084745 0.468456 0.408953
H  -5.43168 -0.785615 -1.724973
H  -4.968435 0.885137 -2.053407
H  -3.791436 -0.416767 -2.236001
H  2.821937 0.700468 3.40386
H  2.739273 1.811731 2.023838
H  3.955038 0.511026 2.056036
H  1.800211 2.051192 -2.173042
H  1.333342 0.363131 -2.439821
H  3.049085 0.793447 -2.247814
elementType: S P O C H
totalener: -1601.28939883 hartree
nucrepener: 1131.75019749 hartree
electener: -2733.03959632 hartree
oneelecener: -4456.13645638 hartree
twoeener: 1723.09686007 hartree
cpcmener: -0.02660868 hartree
kineticenergy: 1596.99746308 hartree
xcener: -99.367247379084 hartree
chargesum: -0.0000000
charge: -0.179611 -0.174487 0.816082 -0.345858 -0.346493 -0.624061 -0.095950 -0.151948 -0.100754 -0.253092 -0.111629 -0.120376 0.118796 0.130654 0.112930 0.125736 0.094164 0.106507 0.093121 0.080774 0.085645 0.125449 0.120853 0.119587 0.131464 0.112226 0.130269
qa: -0.1796 -0.1745 0.8161 -0.3459 -0.3465 -0.6241 -0.0959 -0.1519 -0.1008 -0.2531 -0.1116 -0.1204 0.1188 0.1307 0.1129 0.1257 0.0942 0.1065 0.0931 0.0808 0.0856 0.1254 0.1209 0.1196 0.1315 0.1122 0.1303
va: 2.2823 2.1735 5.5242 2.0784 2.0401 1.9953 3.8392 3.9704 3.9469 3.9178 3.8435 3.8295 1.0361 1.0072 1.0088 1.0118 1.0081 1.0016 1.0050 1.0122 1.0017 0.9898 0.9922 0.9944 0.9871 0.9936 1.0015
dispcorr: -0.010812221 hartree
energy: -1601.300211048933
dipole: -13.85250 12.39824 -1.45425 5.90604 -4.79143 1.11461 -4.62748 4.49743 -0.13005
magnitude: 1.83688 au
magnitude: 4.66898 debye
