program: Orca
programVersion: 5.0.4
elementType: S S P O O O C C C C C C H H H H H H H H H H H H H H H
charge: 0
multiplicity: 1
keywords: wb97x-d3
keywords: def2-TZVPP
keywords: def2/J RIJCOSX
keywords: DEFGRID2
keywords: scfconv7
keywords: smallprint printgap noloewdin
keywords: NOSOSCF
formula: C6H15O3PS2
InChI: InChI=1/C6H15O3PS2/c1-4-11-5-6-12-10(7,8-2)9-3/h4-6H2,1-3H3
27 atoms
S  0.811186 1.845394 -0.226728
S  -3.395578 0.505249 0.361182
P  1.872505 0.092366 0.038036
O  1.420036 -0.935174 -1.102382
O  1.218821 -0.58937 1.320716
O  3.320572 0.389723 0.099856
C  -0.90088 1.268218 -0.554597
C  -1.698801 1.040757 0.711792
C  -3.129205 -1.113997 -0.42384
C  -2.348333 -2.10712 0.413136
C  1.867889 -0.749877 -2.448963
C  1.768506 -1.804312 1.853644
H  -0.853589 0.37968 -1.181742
H  -1.349749 2.061496 -1.152853
H  -1.798715 1.973104 1.269765
H  -1.211496 0.326214 1.372818
H  -4.13807 -1.487312 -0.610972
H  -2.665736 -0.9804 -1.402564
H  -2.799105 -2.243573 1.396294
H  -2.330448 -3.077526 -0.086765
H  -1.311345 -1.800798 0.553861
H  2.956205 -0.714572 -2.505809
H  1.455995 0.164012 -2.880428
H  1.510082 -1.602352 -3.021343
H  1.290407 -1.967165 2.816172
H  2.845412 -1.71991 2.003098
H  1.55735 -2.651447 1.201339
elementType: S P O C H
totalener: -1601.28925457 hartree
nucrepener: 1163.53351873 hartree
electener: -2764.82277330 hartree
oneelecener: -4519.52990875 hartree
twoeener: 1754.70713545 hartree
cpcmener: -0.02549572 hartree
kineticenergy: 1596.99827890 hartree
xcener: -99.368408155739 hartree
chargesum: -0.0000000
charge: -0.178099 -0.176759 0.812670 -0.339939 -0.342739 -0.625588 -0.095447 -0.142836 -0.122352 -0.225596 -0.109177 -0.119742 0.118504 0.129548 0.128301 0.109322 0.113937 0.093438 0.083801 0.098097 0.053378 0.124272 0.109528 0.128081 0.125921 0.126914 0.122565
qa: -0.1781 -0.1768 0.8127 -0.3399 -0.3427 -0.6256 -0.0954 -0.1428 -0.1224 -0.2256 -0.1092 -0.1197 0.1185 0.1295 0.1283 0.1093 0.1139 0.0934 0.0838 0.0981 0.0534 0.1243 0.1095 0.1281 0.1259 0.1269 0.1226
va: 2.2803 2.1809 5.5223 2.0489 2.0722 2.0001 3.8549 3.9703 3.9674 3.9034 3.8361 3.8280 1.0206 1.0165 1.0075 1.0241 0.9993 1.0038 1.0158 1.0056 1.0079 0.9994 0.9933 0.9889 0.9885 0.9993 0.9903
dispcorr: -0.012257914 hartree
energy: -1601.301512485729
dipole: -8.51601 7.41169 -1.10432 -12.96817 11.29877 -1.66940 -2.29267 1.40481 -0.88786
magnitude: 2.18968 au
magnitude: 5.56573 debye
