program: Orca
programVersion: 5.0.4
elementType: S S P O O O C C C C C C H H H H H H H H H H H H H H H
charge: 0
multiplicity: 1
keywords: wb97x-d3
keywords: def2-TZVPP
keywords: def2/J RIJCOSX
keywords: DEFGRID2
keywords: scfconv7
keywords: smallprint printgap noloewdin
keywords: NOSOSCF
formula: C6H15O3PS2
InChI: InChI=1/C6H15O3PS2/c1-4-11-5-6-12-10(7,8-2)9-3/h4-6H2,1-3H3
27 atoms
S  0.320113 1.482048 0.193077
S  -3.053162 0.675124 -0.474433
P  1.377353 -0.295962 0.352714
O  2.895978 0.140379 0.107917
O  1.05769 -1.040433 -1.020047
O  1.111246 -1.066526 1.589841
C  -1.020349 1.182577 1.399677
C  -2.073642 0.182635 0.968665
C  -2.211123 -0.141068 -1.864013
C  -2.295227 -1.653957 -1.847813
C  3.629243 0.796408 1.146833
C  1.478629 -2.398639 -1.215208
H  -1.464073 2.166865 1.55269
H  -0.573843 0.879904 2.346518
H  -2.780641 0.078643 1.795387
H  -1.6476 -0.809103 0.813594
H  -2.715754 0.253846 -2.748186
H  -1.17963 0.201788 -1.913926
H  -1.791301 -2.064479 -2.72522
H  -1.816502 -2.085725 -0.968231
H  -3.330812 -1.993441 -1.865853
H  4.613422 1.022066 0.743172
H  3.739977 0.154532 2.020857
H  3.147776 1.73046 1.443763
H  1.136098 -2.691364 -2.204239
H  1.034019 -3.061311 -0.472879
H  2.565014 -2.486971 -1.176785
elementType: S P O C H
totalener: -1601.28681411 hartree
nucrepener: 1182.85921707 hartree
electener: -2784.14603118 hartree
oneelecener: -4559.03895112 hartree
twoeener: 1774.89291993 hartree
cpcmener: -0.02140886 hartree
kineticenergy: 1597.01231915 hartree
xcener: -99.371034000039 hartree
chargesum: 0.0000000
charge: -0.178853 -0.182705 0.848819 -0.358336 -0.343137 -0.621815 -0.097612 -0.124817 -0.106920 -0.270980 -0.109504 -0.135661 0.123569 0.122507 0.128016 0.099071 0.114219 0.088541 0.096917 0.080722 0.091790 0.127487 0.119483 0.106229 0.126343 0.122200 0.134426
qa: -0.1789 -0.1827 0.8488 -0.3583 -0.3431 -0.6218 -0.0976 -0.1248 -0.1069 -0.2710 -0.1095 -0.1357 0.1236 0.1225 0.1280 0.0991 0.1142 0.0885 0.0969 0.0807 0.0918 0.1275 0.1195 0.1062 0.1263 0.1222 0.1344
va: 2.2822 2.1494 5.4780 2.0958 2.0812 1.9684 3.8858 3.9260 3.9259 3.9175 3.8520 3.8418 1.0113 1.0288 1.0060 1.0246 1.0020 1.0305 1.0031 1.0016 1.0162 0.9902 0.9945 0.9969 0.9862 0.9925 0.9930
dispcorr: -0.012398186 hartree
energy: -1601.299212296946
dipole: -2.36427 3.29802 0.93374 -7.72727 7.46684 -0.26043 -3.01431 2.79293 -0.22138
magnitude: 0.99434 au
magnitude: 2.52741 debye
