program: Orca
programVersion: 5.0.4
elementType: S S P O O O C C C C C C H H H H H H H H H H H H H H H
charge: 0
multiplicity: 1
keywords: wb97x-d3
keywords: def2-TZVPP
keywords: def2/J RIJCOSX
keywords: DEFGRID2
keywords: scfconv7
keywords: smallprint printgap noloewdin
keywords: NOSOSCF
formula: C6H15O3PS2
InChI: InChI=1/C6H15O3PS2/c1-4-11-5-6-12-10(7,8-2)9-3/h4-6H2,1-3H3
27 atoms
S  0.537104 1.1526 0.251352
S  -3.341553 -1.012544 -0.058975
P  1.846297 -0.464569 0.256232
O  3.042771 0.099559 1.146415
O  2.518672 -0.564162 -1.180739
O  1.243946 -1.757553 0.641025
C  -0.969567 0.376278 -0.457318
C  -1.846404 -0.236269 0.614906
C  -4.341545 0.435121 -0.540391
C  -4.304912 0.74632 -2.024351
C  2.91846 0.22257 2.568196
C  3.227837 0.511404 -1.796518
H  -0.687873 -0.352148 -1.216648
H  -1.478373 1.195007 -0.965873
H  -2.129095 0.508391 1.3607
H  -1.312686 -1.031372 1.135829
H  -5.364701 0.219227 -0.228763
H  -4.009629 1.287792 0.055002
H  -4.945788 1.603033 -2.244781
H  -3.298538 0.985718 -2.367508
H  -4.666505 -0.095843 -2.614785
H  2.450965 -0.658119 3.008945
H  2.341282 1.109113 2.833037
H  3.925301 0.323761 2.966367
H  2.670869 1.448505 -1.739524
H  3.356769 0.246402 -2.843268
H  4.208342 0.645324 -1.340012
elementType: S P O C H
totalener: -1601.28763283 hartree
nucrepener: 1123.97136896 hartree
electener: -2725.25900179 hartree
oneelecener: -4441.00972358 hartree
twoeener: 1715.75072179 hartree
cpcmener: -0.02584596 hartree
kineticenergy: 1596.99844016 hartree
xcener: -99.367422194045 hartree
chargesum: 0.0000000
charge: -0.212093 -0.178527 0.830946 -0.346754 -0.343153 -0.610402 -0.077648 -0.139744 -0.101631 -0.251163 -0.110775 -0.103916 0.116563 0.133243 0.105264 0.116165 0.107429 0.096789 0.092036 0.077778 0.085555 0.119322 0.114474 0.127508 0.106464 0.126375 0.119896
qa: -0.2121 -0.1785 0.8309 -0.3468 -0.3432 -0.6104 -0.0776 -0.1397 -0.1016 -0.2512 -0.1108 -0.1039 0.1166 0.1332 0.1053 0.1162 0.1074 0.0968 0.0920 0.0778 0.0856 0.1193 0.1145 0.1275 0.1065 0.1264 0.1199
va: 2.2526 2.1613 5.5236 2.0858 2.0951 2.0028 3.8052 3.9975 3.9151 3.9399 3.8529 3.8423 1.0338 1.0072 1.0141 1.0281 1.0036 1.0090 1.0054 1.0069 1.0061 0.9936 0.9905 0.9910 1.0005 0.9897 0.9914
dispcorr: -0.010156748 hartree
energy: -1601.297789575084
dipole: -10.04306 10.33181 0.28876 8.11198 -5.47473 2.63725 -4.16320 4.00753 -0.15567
magnitude: 2.65758 au
magnitude: 6.75503 debye
