program: Orca
programVersion: 5.0.4
elementType: S S P O O O C C C C C C H H H H H H H H H H H H H H H
charge: 0
multiplicity: 1
keywords: wb97x-d3
keywords: def2-TZVPP
keywords: def2/J RIJCOSX
keywords: DEFGRID2
keywords: scfconv7
keywords: smallprint printgap noloewdin
keywords: NOSOSCF
formula: C6H15O3PS2
InChI: InChI=1/C6H15O3PS2/c1-4-11-5-6-12-10(7,8-2)9-3/h4-6H2,1-3H3
27 atoms
S  0.75261 1.573817 0.559637
S  -3.316991 0.826718 -1.065837
P  1.464766 -0.375203 0.514443
O  2.355085 -0.431543 1.835017
O  2.613813 -0.369671 -0.607244
O  0.423227 -1.409315 0.348847
C  -1.051317 1.264725 0.467517
C  -1.519508 1.011125 -0.950806
C  -3.584448 -0.787857 -0.274885
C  -2.924875 -1.956846 -0.982018
C  3.076583 -1.621477 2.14996
C  2.242141 -0.370876 -1.977618
H  -1.511013 2.167837 0.868464
H  -1.301754 0.44035 1.131203
H  -1.024649 0.136276 -1.371703
H  -1.272377 1.862219 -1.587033
H  -3.280198 -0.745564 0.772056
H  -4.669947 -0.900185 -0.276132
H  -1.839996 -1.918365 -0.898682
H  -3.244939 -2.895575 -0.526757
H  -3.196565 -1.98166 -2.036764
H  3.933236 -1.747732 1.487462
H  2.439215 -2.504483 2.087864
H  3.4313 -1.513462 3.171865
H  1.693628 0.538308 -2.235931
H  1.631569 -1.2392 -2.227503
H  3.160733 -0.401386 -2.558076
totalener: -1601.27146027 hartree
nucrepener: 1151.10796312 hartree
electener: -2752.37942339 hartree
oneelecener: -4495.00556052 hartree
twoeener: 1742.62613712 hartree
kineticenergy: 1597.06190967 hartree
xcener: -99.375299677259 hartree
chargesum: 0.0000000
charge: -0.166231 -0.123558 0.793010 -0.326194 -0.327106 -0.530269 -0.074711 -0.171383 -0.130467 -0.237743 -0.141072 -0.131198 0.118984 0.108975 0.091071 0.116103 0.086112 0.100791 0.092375 0.082060 0.081216 0.115615 0.116929 0.117053 0.097625 0.121288 0.120727
qa: -0.1662 -0.1236 0.7930 -0.3262 -0.3271 -0.5303 -0.0747 -0.1714 -0.1305 -0.2377 -0.1411 -0.1312 0.1190 0.1090 0.0911 0.1161 0.0861 0.1008 0.0924 0.0821 0.0812 0.1156 0.1169 0.1171 0.0976 0.1213 0.1207
va: 2.2799 2.2124 5.5130 2.1395 2.0828 2.0583 3.8249 4.0172 3.9875 3.8858 3.8879 3.8824 1.0210 1.0326 1.0239 1.0095 1.0064 1.0006 1.0185 1.0084 1.0144 0.9902 0.9920 0.9897 0.9944 0.9907 0.9937
dispcorr: -0.011475696 hartree
energy: -1601.282935969015
dipole: -5.84583 6.60626 0.76043 -9.21464 8.82043 -0.39421 -4.46835 4.41538 -0.05297
magnitude: 0.85817 au
magnitude: 2.18130 debye
