program: Orca
programVersion: 5.0.4
elementType: S S P O O O C C C C C C H H H H H H H H H H H H H H H
charge: 0
multiplicity: 1
keywords: wb97x-d3
keywords: def2-TZVPP
keywords: def2/J RIJCOSX
keywords: DEFGRID2
keywords: scfconv7
keywords: smallprint printgap noloewdin
keywords: NOSOSCF
formula: C6H15O3PS2
InChI: InChI=1/C6H15O3PS2/c1-4-11-5-6-12-10(7,8-2)9-3/h4-6H2,1-3H3
27 atoms
S  0.57058 1.715198 0.557125
S  -1.835283 0.38666 -1.528524
P  0.923605 -0.311441 0.866601
O  2.44162 -0.167576 1.37483
O  1.050954 -1.073576 -0.536392
O  -0.026451 -1.001341 1.755561
C  -1.230489 1.781524 0.839741
C  -2.052953 1.806136 -0.438499
C  -2.641555 -0.935756 -0.578826
C  -2.461022 -2.248379 -1.32122
C  3.165439 -1.347083 1.716291
C  1.707055 -0.496143 -1.654272
H  -1.396869 2.704438 1.398355
H  -1.510938 0.959278 1.496562
H  -1.787918 2.678072 -1.038239
H  -3.109678 1.912151 -0.177631
H  -2.19362 -1.01364 0.411009
H  -3.700936 -0.697123 -0.464818
H  -2.961611 -3.052312 -0.781898
H  -2.881668 -2.206528 -2.326044
H  -1.405545 -2.505675 -1.39745
H  3.360392 -1.967811 0.839664
H  2.630739 -1.941139 2.458507
H  4.114431 -1.025151 2.137889
H  2.716519 -0.157664 -1.408374
H  1.13073 0.341558 -2.046644
H  1.773265 -1.269743 -2.415889
totalener: -1601.26764949 hartree
nucrepener: 1203.63355190 hartree
electener: -2804.90120139 hartree
oneelecener: -4600.42050148 hartree
twoeener: 1795.51930009 hartree
kineticenergy: 1597.06454045 hartree
xcener: -99.379754176903 hartree
chargesum: -0.0000000
charge: -0.161348 -0.124359 0.815366 -0.341561 -0.317781 -0.528408 -0.134961 -0.141579 -0.140950 -0.251981 -0.144457 -0.137299 0.118536 0.126399 0.107783 0.097180 0.108404 0.096234 0.084783 0.087654 0.092707 0.105560 0.123419 0.116378 0.116158 0.109631 0.118491
qa: -0.1613 -0.1244 0.8154 -0.3416 -0.3178 -0.5284 -0.1350 -0.1416 -0.1410 -0.2520 -0.1445 -0.1373 0.1185 0.1264 0.1078 0.0972 0.1084 0.0962 0.0848 0.0877 0.0927 0.1056 0.1234 0.1164 0.1162 0.1096 0.1185
va: 2.2626 2.2042 5.4942 2.1053 2.0546 2.1066 3.8578 3.9817 3.9629 3.9407 3.9021 3.8646 1.0096 1.0250 1.0081 1.0125 1.0198 1.0039 1.0054 1.0053 1.0124 0.9871 0.9936 0.9887 0.9899 1.0070 0.9892
dispcorr: -0.012319665 hartree
energy: -1601.279969153439
dipole: -5.41137 5.79975 0.38837 -6.45326 6.64522 0.19197 -4.76704 4.41340 -0.35365
magnitude: 0.55924 au
magnitude: 1.42148 debye
