program: Gaussian 09
title: 000006131
version: EM64L-G09RevD.01
frameworkgroup: C1[X(C9H14N3O8P)]
method: RPBEPBE
basis: SDD
operation: Freq
keyword: #p
keyword: freq=noraman
keyword: PBEPBE/SDD
title: #p freq=noraman PBEPBE/SDD
converged: YES YES NO NO
title: Mulliken charges:
elementType: P O O O O O O O O N N N C C C C C C C C C H H H H H H H H H H H H H H
charge: 1.384875 -0.277892 -0.445088 -0.466863 -0.512868 -0.330952 -0.687562 -0.674241 -0.577224 -0.209096 -0.043100 -0.619632 -0.139999 -0.206176 -0.062962 -0.067516 -0.289279 -0.067318 0.109483 -0.347651 0.191358 0.226211 0.242063 0.285120 0.286254 0.249411 0.246591 0.378014 0.396057 0.315646 0.239659 0.323337 0.343576 0.407475 0.400290
chargesum: 0.00000
title: Mulliken charges with hydrogens summed into heavy atoms:
elementType: P O O O O O O O O N N N C C C C C C C C C
charge: 1.384875 -0.277892 -0.067074 -0.070806 -0.512868 -0.330952 -0.280087 -0.273951 -0.577224 -0.209096 -0.043100 0.047280 0.086212 0.035888 0.222159 0.218738 0.206723 0.248328 0.109483 -0.107992 0.191358
polarizability: 1.87646009e+02 7.87011302e+00 2.11887532e+02 -1.43186612e+01 3.04966738e+00 1.10269730e+02
1716.lowfreq: -9.9920 -8.2886 -5.0622 -0.0013 -0.0012 -0.0010 7.0453 10.7354 31.3738
frequency: 5.4147 10.4703 31.3344 41.4660 61.7955 76.6546 97.3128 115.6102 156.2709 163.2368 180.1635 196.6246 204.5301 223.4435 241.1612 275.8966 283.6085 298.9217 315.3635 319.4184 347.1514 356.9320 371.7872 378.0422 386.1033 405.8565 436.8407 452.9529 502.8567 524.4625 546.6504 557.6513 573.7200 575.8155 605.8756 634.9992 663.2083 696.3937 718.2492 723.8640 741.6830 744.8817 750.7439 789.3402 805.7920 809.6393 848.1797 883.4533 933.0980 946.4087 973.7850 982.2495 986.6939 1002.6196 1014.6458 1021.0624 1026.8876 1044.0562 1062.2236 1075.6260 1085.4970 1085.9267 1095.6120 1168.5923 1192.4706 1209.2527 1221.1467 1231.7275 1256.4194 1257.9760 1273.2017 1311.2528 1318.0263 1332.3342 1334.8118 1363.1738 1367.3763 1389.8967 1396.5899 1463.4027 1472.0219 1503.3097 1574.5729 1625.3655 1636.5332 2968.8048 2984.8188 2998.2754 3022.0792 3066.8071 3092.1566 3165.6457 3171.6349 3192.7210 3415.7673 3540.7879 3593.2935 3613.4190 3697.6851
redmass: 7.4518 8.4147 6.6140 6.7824 5.1912 7.4951 6.8751 4.5146 3.6610 4.5030 3.3148 5.4408 3.3065 6.8139 3.5256 4.4042 4.8634 2.6099 5.3628 6.8269 5.3700 3.5747 7.2676 2.2551 2.6215 5.6524 3.2040 1.1594 2.3131 6.2869 2.2132 1.9872 4.1902 1.4168 6.4694 10.2325 5.5323 3.2633 5.4923 9.8648 7.2844 7.3684 6.4221 1.6839 1.1034 4.0584 4.7631 3.0724 3.1296 6.5246 2.8125 2.4137 1.3380 1.3306 1.2415 2.9447 3.5530 3.4694 3.1073 3.3841 2.4743 3.9609 5.5148 1.8174 1.4038 1.1367 4.2133 1.3549 1.2479 1.4829 1.2258 1.3322 1.2404 1.3215 1.2465 1.3507 1.8711 1.5774 1.6669 1.0847 4.6759 4.4724 3.0975 1.7341 5.3984 1.0840 1.0820 1.0620 1.0858 1.1037 1.0911 1.0658 1.0903 1.0997 1.0644 1.0454 1.0662 1.0665 1.1045
irintensity: 0.8433 3.3119 0.3920 5.5063 1.6425 1.1361 3.4966 2.9610 19.1026 7.4876 48.2345 22.1721 11.9844 6.6190 19.2277 17.9073 22.1047 21.5293 26.4969 11.7102 40.6941 13.4193 52.0027 75.8969 57.9578 28.6933 4.6116 142.7521 56.6064 5.5315 59.3847 61.0484 41.5409 114.2782 1.4191 18.4729 50.0364 0.7697 54.2904 234.2872 60.6992 66.0027 31.7585 61.1926 141.1625 32.5847 6.3047 25.5948 18.0902 231.1087 71.4462 33.5013 6.5128 31.4726 158.1327 16.8278 82.2742 19.1620 93.5292 12.0326 44.3882 105.9323 128.5036 36.1443 15.1314 6.4425 82.4775 78.3978 36.3055 34.0308 38.1728 1.2508 6.9540 15.6658 71.0621 52.5983 12.4972 120.0463 347.4570 15.0446 98.4563 114.1139 152.9928 89.3700 769.3041 10.1930 60.8255 34.9881 16.6234 7.9133 24.6753 483.5546 16.6787 6.6552 55.9136 124.2850 80.1075 71.7858 41.5176
temp: 298.150 k
press: 1.00000 atm
elementType: 15 8 8 8 8 8 8 8 8 7 7 7 6 6 6 6 6 6 6 6 6 1 1 1 1 1 1 1 1 1 1 1 1 1 1
symmnumber: 1
zpe: 663278.9 jmol-1
zpe.correction: 0.252630 hartree
zpe.thermalcorrener: 0.274013 hartree
zpe.thermalcorrenthalpy: 0.274957 hartree
zpe.thermalcorrgfe: 0.198554 hartree
zpe.sumelectzpe: -1457.004956 hartree
zpe.sumelectthermal: -1456.983573 hartree
zpe.sumelectthermalent: -1456.982629 hartree
zpe.sumelectthermalfe: -1457.059032 hartree
dipole: 3.4369 -4.9993 2.5964
dipole: 6.5990
quadrupole: -127.3562 -120.5786 -133.2832
quadrupole: 24.7479 13.8004 -6.0747
quadrupole: -0.2835 6.4940 -6.2105 24.7479 13.8004 -6.0747
hfenergy: -1457.2575857 hartree
pointgroup: C01 [X(C9H14N3O8P1)]
dipole: 1.1241268 -2.0792027 1.0741157 debye
polarizability: 190.050482|9.8781295|210.169458|-12.2952251|3.3835885|109.5833301 unknown
InChI: InChI=1S/C9H14N3O8P/c10-5-1-2-12(9(15)11-5)8-7(14)6(13)4(20-8)3-19-21(16,17)18/h1-2,4,6-8,13-14,16-17H,3,10H2
charge 0 multiplicity 1
35 atoms
P  3.962221 -1.562301 0.242509
O  0.438788 0.856656 -1.177234
O  0.616691 3.850133 -0.425448
O  -1.596699 3.098646 0.79635
O  2.824509 -0.450909 -0.376709
O  -3.378234 1.178224 0.426462
O  3.21632 -1.919012 1.746247
O  5.300332 -0.633779 0.840284
O  4.334142 -2.727498 -0.755682
N  -1.582679 -0.120123 -0.325707
N  -3.653868 -1.150793 0.37609
N  -3.888681 -3.457664 0.33603
C  0.764178 2.662411 0.398708
C  -0.630336 2.032725 0.662254
C  1.499218 1.571227 -0.407132
C  -0.866134 1.162945 -0.614076
C  2.257902 0.605142 0.505813
C  -1.023182 -1.349258 -0.59791
C  -2.934487 0.002411 0.182459
C  -1.744838 -2.509295 -0.380409
C  -3.094657 -2.359478 0.111962
H  1.282418 2.909363 1.347953
H  -0.606477 1.380706 1.559488
H  2.175638 2.013982 -1.1553
H  -1.470281 1.729099 -1.348362
H  1.603169 0.123325 1.25351
H  3.078908 1.139456 1.021999
H  -0.287356 4.217863 -0.204493
H  -2.496285 2.63683 0.713405
H  -0.003694 -1.330629 -0.992334
H  -1.302128 -3.483941 -0.592293
H  -3.559715 -4.403641 0.163773
H  -4.836151 -3.29849 0.675908
H  3.774955 -2.404957 2.402723
H  6.066893 -0.572875 0.214563
