program: Orca
programVersion: 5.0.4
elementType: S S P O O O C C C C C C H H H H H H H H H H H H H H H
charge: 0
multiplicity: 1
keywords: wb97x-d3
keywords: def2-TZVPP
keywords: def2/J RIJCOSX
keywords: DEFGRID2
keywords: scfconv7
keywords: smallprint printgap noloewdin
keywords: NOSOSCF
formula: C6H15O3PS2
InChI: InChI=1/C6H15O3PS2/c1-4-11-5-6-12-10(7,8-2)9-3/h4-6H2,1-3H3
27 atoms
S  0.251796 1.274069 0.67299
S  -3.051086 0.605283 -0.164267
P  1.490874 -0.123082 -0.216543
O  1.983943 -0.987776 1.040875
O  2.813557 0.707341 -0.553155
O  0.900096 -0.879202 -1.338956
C  -0.64017 1.908833 -0.791939
C  -1.730317 1.004105 -1.334276
C  -2.455322 -0.934464 0.603756
C  -3.637923 -1.803368 0.993855
C  1.17228 -2.034484 1.556065
C  3.887448 0.054505 -1.228653
H  0.083775 2.149567 -1.571993
H  -1.065105 2.850336 -0.443971
H  -1.308819 0.087224 -1.742874
H  -2.214602 1.526719 -2.163081
H  -1.813055 -1.450677 -0.111686
H  -1.848492 -0.693089 1.475837
H  -4.304462 -1.285736 1.684067
H  -4.219678 -2.093189 0.120134
H  -3.292734 -2.710956 1.491086
H  0.890223 -2.744882 0.778278
H  0.267466 -1.639902 2.02247
H  1.759688 -2.548139 2.3135
H  3.543723 -0.461412 -2.125832
H  4.386235 -0.660227 -0.572421
H  4.598152 0.826751 -1.512102
totalener: -1601.26758012 hartree
nucrepener: 1171.68392670 hartree
electener: -2772.95150682 hartree
oneelecener: -4536.26350614 hartree
twoeener: 1763.31199932 hartree
kineticenergy: 1597.06892971 hartree
xcener: -99.377340713056 hartree
chargesum: -0.0000000
charge: -0.144453 -0.128787 0.800831 -0.335996 -0.327507 -0.532585 -0.122889 -0.143045 -0.120922 -0.240293 -0.128986 -0.141463 0.114106 0.116426 0.119795 0.109003 0.087940 0.075152 0.088105 0.089073 0.077237 0.120218 0.098691 0.122375 0.118780 0.112793 0.116400
qa: -0.1445 -0.1288 0.8008 -0.3360 -0.3275 -0.5326 -0.1229 -0.1430 -0.1209 -0.2403 -0.1290 -0.1415 0.1141 0.1164 0.1198 0.1090 0.0879 0.0752 0.0881 0.0891 0.0772 0.1202 0.0987 0.1224 0.1188 0.1128 0.1164
va: 2.2889 2.1874 5.5159 2.0939 2.1197 2.0593 3.9040 3.9351 3.9898 3.9518 3.8818 3.8869 1.0205 1.0111 1.0291 1.0070 1.0086 1.0097 1.0021 1.0140 1.0053 0.9940 0.9887 0.9926 0.9933 0.9900 0.9894
dispcorr: -0.011497152 hartree
energy: -1601.279077273339
dipole: -5.54568 6.31654 0.77086 -8.67899 8.33729 -0.34170 0.21820 -0.08800 0.13021
magnitude: 0.85319 au
magnitude: 2.16864 debye
