program: Orca
programVersion: 5.0.4
elementType: S S P O O O C C C C C C H H H H H H H H H H H H H H H
charge: 0
multiplicity: 1
keywords: wb97x-d3
keywords: def2-TZVPP
keywords: def2/J RIJCOSX
keywords: DEFGRID2
keywords: scfconv7
keywords: smallprint printgap noloewdin
keywords: NOSOSCF
formula: C6H15O3PS2
InChI: InChI=1/C6H15O3PS2/c1-4-11-5-6-12-10(7,8-2)9-3/h4-6H2,1-3H3
27 atoms
S  0.023199 1.139882 0.381133
S  -2.316892 -0.833971 -1.151695
P  1.668585 -0.09446 0.660679
O  2.73846 0.906421 1.292317
O  2.293984 -0.287873 -0.803363
O  1.372779 -1.334666 1.405024
C  -1.254126 0.183902 1.263704
C  -1.758507 -1.05934 0.549425
C  -3.694857 0.321723 -0.917244
C  -4.414754 0.521873 -2.239545
C  4.050065 0.433547 1.591611
C  1.623488 -1.118679 -1.743385
H  -2.060295 0.902595 1.416986
H  -0.87885 -0.09092 2.248666
H  -2.570725 -1.489732 1.142644
H  -0.968038 -1.808444 0.512079
H  -4.377912 -0.084232 -0.167476
H  -3.322112 1.279326 -0.549234
H  -4.816081 -0.416968 -2.618795
H  -5.244416 1.217602 -2.115808
H  -3.745808 0.933661 -2.995122
H  4.023284 -0.524033 2.114146
H  4.513713 1.173944 2.238911
H  4.645602 0.331618 0.683668
H  0.604694 -0.7662 -1.926992
H  1.588377 -2.155534 -1.405482
H  2.186916 -1.064898 -2.671783
totalener: -1601.26863244 hartree
nucrepener: 1156.56627487 hartree
electener: -2757.83490731 hartree
oneelecener: -4506.14208780 hartree
twoeener: 1748.30718049 hartree
kineticenergy: 1597.06121597 hartree
xcener: -99.377716130553 hartree
chargesum: -0.0000000
charge: -0.152091 -0.104204 0.797053 -0.329311 -0.327794 -0.532652 -0.128928 -0.178379 -0.122913 -0.254546 -0.138433 -0.122055 0.117141 0.131945 0.107011 0.128753 0.088206 0.079856 0.090991 0.084810 0.090690 0.115146 0.115116 0.115004 0.096081 0.117858 0.115643
qa: -0.1521 -0.1042 0.7971 -0.3293 -0.3278 -0.5327 -0.1289 -0.1784 -0.1229 -0.2545 -0.1384 -0.1221 0.1171 0.1319 0.1070 0.1288 0.0882 0.0799 0.0910 0.0848 0.0907 0.1151 0.1151 0.1150 0.0961 0.1179 0.1156
va: 2.2756 2.2207 5.5263 2.1338 2.0867 2.0690 3.8574 3.9748 4.0060 3.9433 3.8884 3.8621 0.9974 1.0244 1.0121 1.0216 0.9976 0.9966 1.0097 1.0032 1.0073 0.9932 0.9897 0.9901 1.0167 0.9925 0.9950
dispcorr: -0.010779719 hartree
energy: -1601.279412161583
dipole: -11.37436 11.12098 -0.25339 -1.43725 1.74261 0.30536 -4.60768 4.52748 -0.08020
magnitude: 0.40482 au
magnitude: 1.02897 debye
