program: Orca
programVersion: 5.0.4
elementType: S S P O O O C C C C C C H H H H H H H H H H H H H H H
charge: 0
multiplicity: 1
keywords: wb97x-d3
keywords: def2-TZVPP
keywords: def2/J RIJCOSX
keywords: DEFGRID2
keywords: scfconv7
keywords: smallprint printgap noloewdin
keywords: NOSOSCF
formula: C6H15O3PS2
InChI: InChI=1/C6H15O3PS2/c1-4-11-5-6-12-10(7,8-2)9-3/h4-6H2,1-3H3
27 atoms
S  0.51073 1.352091 0.288562
S  -3.169091 -0.998665 -0.557844
P  1.861894 -0.213876 0.432718
O  2.38041 -0.100489 1.937649
O  3.132372 0.344624 -0.369457
O  1.350111 -1.531078 0.008762
C  -1.064432 0.440053 0.512875
C  -1.559832 -0.196431 -0.771046
C  -4.268584 0.446182 -0.542446
C  -5.71103 -0.02123 -0.451378
C  3.23631 -1.112624 2.463677
C  3.134531 0.289537 -1.791136
H  -1.758537 1.1975 0.877626
H  -0.954334 -0.303232 1.300235
H  -0.86775 -0.97647 -1.085427
H  -1.619398 0.539023 -1.575776
H  -4.032314 1.093364 0.303937
H  -4.112136 1.022671 -1.456462
H  -6.386455 0.834213 -0.446621
H  -5.975757 -0.653448 -1.298267
H  -5.886286 -0.589901 0.461415
H  4.234786 -1.047679 2.029177
H  2.832093 -2.110009 2.288576
H  3.30592 -0.939795 3.534689
H  3.097129 -0.739428 -2.149162
H  4.059606 0.753428 -2.124224
H  2.291964 0.843136 -2.211154
totalener: -1601.27017417 hartree
nucrepener: 1115.79740754 hartree
electener: -2717.06758171 hartree
oneelecener: -4424.45297574 hartree
twoeener: 1707.38539403 hartree
kineticenergy: 1597.06222742 hartree
xcener: -99.373021479750 hartree
chargesum: -0.0000000
charge: -0.172545 -0.109289 0.794155 -0.323340 -0.334729 -0.528196 -0.097443 -0.144927 -0.132089 -0.251976 -0.136948 -0.118840 0.110458 0.114576 0.134540 0.086682 0.079279 0.085562 0.083786 0.091546 0.090046 0.111847 0.120049 0.116050 0.120506 0.116126 0.095116
qa: -0.1725 -0.1093 0.7942 -0.3233 -0.3347 -0.5282 -0.0974 -0.1449 -0.1321 -0.2520 -0.1369 -0.1188 0.1105 0.1146 0.1345 0.0867 0.0793 0.0856 0.0838 0.0915 0.0900 0.1118 0.1200 0.1161 0.1205 0.1161 0.0951
va: 2.2732 2.2225 5.5351 2.1175 2.0965 2.0723 3.8634 3.9690 4.0220 3.9337 3.8823 3.8773 1.0111 1.0340 1.0279 1.0192 0.9955 0.9972 1.0034 1.0099 1.0081 0.9898 0.9934 0.9891 0.9941 0.9913 0.9992
dispcorr: -0.009593197 hartree
energy: -1601.279767367960
dipole: -12.27226 12.54067 0.26841 0.22803 0.50639 0.73442 -3.03887 2.98062 -0.05825
magnitude: 0.78410 au
magnitude: 1.99302 debye
