program: Orca
programVersion: 5.0.4
elementType: S S P O O O C C C C C C H H H H H H H H H H H H H H H
charge: 0
multiplicity: 1
keywords: wb97x-d3
keywords: def2-TZVPP
keywords: def2/J RIJCOSX
keywords: DEFGRID2
keywords: scfconv7
keywords: smallprint printgap noloewdin
keywords: NOSOSCF
formula: C6H15O3PS2
InChI: InChI=1/C6H15O3PS2/c1-4-11-5-6-12-10(7,8-2)9-3/h4-6H2,1-3H3
27 atoms
S  0.241644 1.53038 -0.032258
S  -3.154522 0.721342 -0.527785
P  1.403317 -0.120204 0.42275
O  2.452259 0.454645 1.481765
O  2.311938 -0.255233 -0.891385
O  0.676291 -1.340187 0.829873
C  -1.067828 1.37872 1.234878
C  -2.145385 0.356292 0.930132
C  -2.307895 -0.131802 -1.891721
C  -2.108891 -1.621528 -1.687965
C  3.348126 -0.443377 2.133437
C  1.820246 -0.992293 -2.005015
H  -1.496244 2.379812 1.286989
H  -0.604047 1.175315 2.201332
H  -2.847541 0.353748 1.767833
H  -1.728947 -0.647339 0.876398
H  -2.967887 0.048002 -2.742864
H  -1.364734 0.367766 -2.109162
H  -1.377422 -1.8328 -0.908502
H  -3.044829 -2.110865 -1.421123
H  -1.739979 -2.078777 -2.608303
H  4.081267 -0.846521 1.433175
H  2.814321 -1.26685 2.608155
H  3.869005 0.131653 2.894821
H  2.599842 -0.97871 -2.762735
H  0.919938 -0.53398 -2.420741
H  1.597363 -2.024552 -1.734769
totalener: -1601.26846833 hartree
nucrepener: 1180.69767125 hartree
electener: -2781.96613958 hartree
oneelecener: -4554.25178094 hartree
twoeener: 1772.28564137 hartree
kineticenergy: 1597.06660521 hartree
xcener: -99.378076101053 hartree
chargesum: -0.0000000
charge: -0.143980 -0.128145 0.794300 -0.326275 -0.334075 -0.532820 -0.118820 -0.153586 -0.125851 -0.267184 -0.139334 -0.122991 0.116652 0.113125 0.110958 0.120726 0.105641 0.077009 0.088656 0.096790 0.083330 0.111041 0.119086 0.117347 0.122041 0.095711 0.120649
qa: -0.1440 -0.1281 0.7943 -0.3263 -0.3341 -0.5328 -0.1188 -0.1536 -0.1259 -0.2672 -0.1393 -0.1230 0.1167 0.1131 0.1110 0.1207 0.1056 0.0770 0.0887 0.0968 0.0833 0.1110 0.1191 0.1173 0.1220 0.0957 0.1206
va: 2.2914 2.1868 5.5174 2.1180 2.0921 2.0532 3.8961 3.9402 3.9693 3.8882 3.8876 3.8883 1.0127 1.0197 1.0080 1.0262 1.0036 1.0245 1.0165 1.0184 1.0036 0.9900 0.9935 0.9892 0.9923 0.9848 0.9937
dispcorr: -0.012424716 hartree
energy: -1601.280893042618
dipole: -2.65684 3.48038 0.82355 -8.77188 8.50007 -0.27180 -3.68319 3.65284 -0.03035
magnitude: 0.86777 au
magnitude: 2.20570 debye
