program: Orca
programVersion: 5.0.4
elementType: S S P O O O C C C C C C H H H H H H H H H H H H H H H
charge: 0
multiplicity: 1
keywords: wb97x-d3
keywords: def2-TZVPP
keywords: def2/J RIJCOSX
keywords: DEFGRID2
keywords: scfconv7
keywords: smallprint printgap noloewdin
keywords: NOSOSCF
formula: C6H15O3PS2
InChI: InChI=1/C6H15O3PS2/c1-4-11-5-6-12-10(7,8-2)9-3/h4-6H2,1-3H3
27 atoms
S  0.536876 1.582594 0.322033
S  -2.227287 0.477827 -1.476672
P  1.234071 -0.352043 0.611178
O  2.502328 -0.09188 1.545512
O  1.971616 -0.735799 -0.75757
O  0.231062 -1.319724 1.101721
C  -1.171578 1.463694 0.950703
C  -2.210713 1.68551 -0.13678
C  -2.811084 -1.005893 -0.60635
C  -3.066452 -2.104664 -1.623502
C  3.298856 -1.19627 1.966507
C  1.203552 -1.098409 -1.900308
H  -1.274706 2.238781 1.711738
H  -1.302422 0.503016 1.445352
H  -2.058136 2.653892 -0.616196
H  -3.200387 1.720238 0.32784
H  -2.063823 -1.328378 0.117636
H  -3.731981 -0.76333 -0.071533
H  -3.414659 -3.00698 -1.121362
H  -3.821545 -1.809487 -2.351551
H  -2.15647 -2.361268 -2.16643
H  3.911908 -1.573533 1.147238
H  2.684366 -2.00758 2.359343
H  3.94957 -0.832646 2.757916
H  0.504352 -0.306899 -2.173308
H  0.642679 -2.017231 -1.723194
H  1.906814 -1.258658 -2.714061
totalener: -1601.26991615 hartree
nucrepener: 1178.93060284 hartree
electener: -2780.20051899 hartree
oneelecener: -4550.97256886 hartree
twoeener: 1770.77204987 hartree
kineticenergy: 1597.06517471 hartree
xcener: -99.379228969112 hartree
chargesum: 0.0000000
charge: -0.151903 -0.115195 0.809777 -0.326976 -0.329368 -0.536767 -0.130937 -0.143984 -0.148034 -0.250063 -0.140042 -0.123021 0.118522 0.119941 0.108266 0.098752 0.116784 0.091180 0.088576 0.091672 0.076431 0.114320 0.116036 0.114856 0.106560 0.108843 0.115775
qa: -0.1519 -0.1152 0.8098 -0.3270 -0.3294 -0.5368 -0.1309 -0.1440 -0.1480 -0.2501 -0.1400 -0.1230 0.1185 0.1199 0.1083 0.0988 0.1168 0.0912 0.0886 0.0917 0.0764 0.1143 0.1160 0.1149 0.1066 0.1088 0.1158
va: 2.2780 2.2080 5.5165 2.1340 2.0920 2.0612 3.8601 3.9899 3.9734 3.9425 3.8901 3.8672 1.0089 1.0286 1.0071 1.0115 1.0124 1.0016 1.0038 1.0090 1.0100 0.9907 0.9925 0.9898 1.0130 0.9934 0.9940
dispcorr: -0.011711676 hartree
energy: -1601.281627830579
dipole: -9.40647 9.36199 -0.04447 -8.35423 8.21674 -0.13749 -2.95602 3.08584 0.12981
magnitude: 0.19425 au
magnitude: 0.49374 debye
