program: Orca
programVersion: 5.0.4
elementType: S P O O O N C C C C C C C C C H H H H H H H H H H
charge: 0
multiplicity: 1
keywords: wb97x-d3
keywords: def2-TZVPP
keywords: def2/J RIJCOSX
keywords: DEFGRID2
keywords: scfconv7
keywords: smallprint printgap noloewdin
keywords: NOSOSCF
formula: C9H10NO3PS
InChI: InChI=1/C9H10NO3PS/c1-11-14(15,12-2)13-9-5-3-8(7-10)4-6-9/h3-6H,1-2H3
25 atoms
S  1.83131 -0.002589 -2.091024
P  1.83552 0.165529 -0.186012
O  0.59567 0.95441 0.499892
O  1.779533 -1.19193 0.652692
O  3.057434 1.023021 0.34882
N  -5.828159 -0.838533 -0.162102
C  -0.71051 0.557061 0.335265
C  -1.420922 0.995163 -0.772752
C  -1.296953 -0.237595 1.308866
C  -2.748947 0.633884 -0.907769
C  -2.625158 -0.595873 1.175167
C  -3.349717 -0.164364 0.064406
C  2.552565 -2.337372 0.271376
C  3.242879 1.32545 1.743459
C  -4.719106 -0.535847 -0.065184
H  -0.946857 1.623525 -1.513999
H  -0.727668 -0.560264 2.169956
H  -3.317369 0.971038 -1.763725
H  -3.098945 -1.209514 1.928819
H  2.376809 -2.598965 -0.772238
H  2.227404 -3.157316 0.906615
H  3.616085 -2.157816 0.429013
H  3.092193 0.448366 2.371663
H  2.567379 2.120334 2.05518
H  4.269243 1.664813 1.851011
elementType: S P O N C H
totalener: -1369.10927419 hartree
nucrepener: 1231.48811246 hartree
electener: -2600.59738665 hartree
oneelecener: -4326.55948074 hartree
twoeener: 1725.96209409 hartree
cpcmener: -0.02907764 hartree
kineticenergy: 1364.96696000 hartree
xcener: -95.384361921746 hartree
chargesum: -0.0000000
charge: -0.431683 0.732480 -0.350538 -0.332099 -0.339492 -0.132028 0.260495 -0.147319 -0.142259 -0.198329 -0.196795 0.197535 -0.106489 -0.110592 -0.074220 0.154822 0.157321 0.158809 0.158047 0.111561 0.128129 0.129061 0.123015 0.121643 0.128926
qa: -0.4317 0.7325 -0.3505 -0.3321 -0.3395 -0.1320 0.2605 -0.1473 -0.1423 -0.1983 -0.1968 0.1975 -0.1065 -0.1106 -0.0742 0.1548 0.1573 0.1588 0.1580 0.1116 0.1281 0.1291 0.1230 0.1216 0.1289
va: 2.0290 5.5161 2.0945 2.0662 2.1062 3.1135 3.7535 3.9803 3.9888 4.0348 4.0225 3.5677 3.8294 3.8405 3.9678 1.0065 1.0027 1.0033 1.0034 1.0042 0.9903 0.9845 0.9917 0.9909 0.9896
dispcorr: -0.010572259 hartree
energy: -1369.119846447918
dipole: 7.86325 -5.38219 2.48105 -2.77352 2.67404 -0.09948 7.62755 -5.39985 2.22771
magnitude: 3.33589 au
magnitude: 8.47917 debye
