program: Orca
programVersion: 5.0.2
elementType: Cl S P O O O O O C C C C C C C C C C C C C C H H H H H H H H H H H H H H H H
charge: 0
multiplicity: 1
keywords: wb97x-d3
keywords: def2-TZVPP
keywords: def2/J RIJCOSX
keywords: DEFGRID2
keywords: scfconv7
keywords: smallprint printgap noloewdin
keywords: NOSOSCF
formula: C14H16ClO5PS
InChI: InChI=1/C14H16ClO5PS/c1-4-17-21(22,18-5-2)20-10-6-7-11-9(3)13(15)14(16)19-12(11)8-10/h6-8H,4-5H2,1-3H3
38 atoms
Cl 5.841077 -0.495696 0.769875
S  -3.194026 0.98205 1.482135
P  -3.084348 0.094194 -0.215126
O  -1.861567 0.585862 -1.177815
O  2.373942 -1.418819 -0.793566
O  -2.926842 -1.485019 -0.208694
O  -4.28705 0.254879 -1.234432
O  4.281015 -2.488299 -0.681343
C  2.068435 0.754404 0.156281
C  1.578433 -0.352541 -0.531555
C  3.448954 0.75525 0.592483
C  -0.567109 0.637513 -0.720186
C  0.268462 -0.431274 -0.975343
C  1.189046 1.819251 0.386318
C  -0.118511 1.768675 -0.043763
C  4.190273 -0.340115 0.311347
C  3.970395 1.945413 1.317995
C  3.665785 -1.489262 -0.407996
C  -2.819761 -2.286179 0.989005
C  -4.762225 1.554027 -1.662551
C  -1.392208 -2.396478 1.458829
C  -5.976461 1.976501 -0.875128
H  -0.081941 -1.30555 -1.508401
H  1.53303 2.698711 0.911847
H  -0.788537 2.59772 0.133983
H  3.859914 2.839181 0.702597
H  5.01696 1.848157 1.587584
H  3.398404 2.111772 2.231951
H  -3.218705 -3.259821 0.710548
H  -3.459872 -1.870166 1.767932
H  -5.000303 1.436783 -2.718641
H  -3.967106 2.298913 -1.587391
H  -0.989597 -1.427421 1.755343
H  -1.357453 -3.052944 2.32897
H  -0.74706 -2.823767 0.691463
H  -5.739947 2.127908 0.177439
H  -6.778613 1.242603 -0.953047
H  -6.345505 2.920524 -1.276653
elementType: Cl S P O C H
totalener: -2119.24339866 hartree
nucrepener: 2329.50870477 hartree
electener: -4448.75210344 hartree
oneelecener: -7546.22838804 hartree
twoeener: 3097.47628460 hartree
cpcmener: -0.03556584 hartree
kineticenergy: 2113.25821145 hartree
xcener: -143.913794292123 hartree
chargesum: 0.0000000
charge: -0.068863 -0.445881 0.759531 -0.358601 -0.229127 -0.353908 -0.351062 -0.442630 -0.043768 0.280745 0.037121 0.338483 -0.290754 -0.104749 -0.204734 0.004142 -0.227062 0.358771 0.055307 0.043522 -0.247510 -0.242071 0.149320 0.161241 0.148074 0.118166 0.088873 0.119036 0.111387 0.094098 0.108831 0.094725 0.075135 0.110945 0.091148 0.075740 0.089952 0.096426
qa: -0.0689 -0.4459 0.7595 -0.3586 -0.2291 -0.3539 -0.3511 -0.4426 -0.0438 0.2807 0.0371 0.3385 -0.2908 -0.1047 -0.2047 0.0041 -0.2271 0.3588 0.0553 0.0435 -0.2475 -0.2421 0.1493 0.1612 0.1481 0.1182 0.0889 0.1190 0.1114 0.0941 0.1088 0.0947 0.0751 0.1109 0.0911 0.0757 0.0900 0.0964
va: 1.2641 1.9771 5.5087 2.0796 2.1999 2.1066 2.1204 2.0701 3.7802 3.8506 3.6993 3.6745 4.0600 3.8850 4.0532 3.6780 3.9429 4.3923 3.8215 3.8703 3.9059 3.9236 1.0177 0.9918 1.0113 0.9952 1.0239 0.9950 0.9939 1.0146 0.9940 0.9989 1.0149 1.0090 1.0015 1.0201 1.0034 1.0079
dispcorr: -0.019630155 hartree
energy: -2119.263028819372
dipole: -28.25833 26.59510 -1.66323 8.36797 -5.88853 2.47944 3.43729 -2.98651 0.45078
magnitude: 3.01946 au
magnitude: 7.67486 debye
