program: Orca
programVersion: 5.0.2
elementType: Cl S P O O O O O C C C C C C C C C C C C C C H H H H H H H H H H H H H H H H
charge: 0
multiplicity: 1
keywords: wb97x-d3
keywords: def2-TZVPP
keywords: def2/J RIJCOSX
keywords: DEFGRID2
keywords: scfconv7
keywords: smallprint printgap noloewdin
keywords: NOSOSCF
formula: C14H16ClO5PS
InChI: InChI=1/C14H16ClO5PS/c1-4-17-21(22,18-5-2)20-10-6-7-11-9(3)13(15)14(16)19-12(11)8-10/h6-8H,4-5H2,1-3H3
38 atoms
Cl 5.921435 0.448198 -0.633752
S  -3.366078 1.981051 1.02337
P  -3.056946 0.22162 0.336308
O  -1.849067 -0.629344 1.012612
O  2.315856 -0.987445 -1.135184
O  -4.279825 -0.753815 0.587071
O  -2.634431 0.111986 -1.196623
O  4.192217 -1.281335 -2.224333
C  2.154577 0.446131 0.773484
C  1.579459 -0.432333 -0.142044
C  3.563221 0.760905 0.652458
C  -0.534357 -0.244178 0.911846
C  0.241235 -0.784534 -0.093984
C  1.330099 0.973325 1.773867
C  -0.005241 0.639578 1.847235
C  4.245669 0.176516 -0.357867
C  4.17561 1.698813 1.631925
C  3.63137 -0.737502 -1.307687
C  -4.348002 -2.109904 0.072801
C  -3.181815 0.972702 -2.217405
C  -4.167778 -3.110883 1.184887
C  -4.634796 0.681342 -2.49818
H  -0.172517 -1.477746 -0.81464
H  1.739099 1.653847 2.507275
H  -0.63051 1.043759 2.6310
H  3.664502 2.662119 1.601221
H  5.230677 1.870661 1.445295
H  4.068807 1.309604 2.645375
H  -3.610278 -2.263504 -0.715579
H  -5.334782 -2.198766 -0.378979
H  -2.568313 0.782307 -3.095771
H  -3.036276 2.013398 -1.922138
H  -3.173598 -3.053762 1.627202
H  -4.911117 -2.977491 1.970928
H  -4.292747 -4.114026 0.775107
H  -5.277109 0.93691 -1.654711
H  -4.791424 -0.366612 -2.754705
H  -4.956844 1.284157 -3.347765
elementType: Cl S P O C H
totalener: -2119.24525870 hartree
nucrepener: 2309.11927047 hartree
electener: -4428.36452917 hartree
oneelecener: -7505.40885252 hartree
twoeener: 3077.04432335 hartree
cpcmener: -0.03795729 hartree
kineticenergy: 2113.25198632 hartree
xcener: -143.910200944237 hartree
chargesum: -0.0000000
charge: -0.068602 -0.432837 0.715076 -0.355418 -0.227133 -0.346657 -0.333277 -0.440858 -0.044632 0.239502 0.037840 0.316076 -0.221943 -0.100879 -0.220523 0.003298 -0.225896 0.361566 0.044886 0.036519 -0.246031 -0.245536 0.148304 0.160456 0.151036 0.118546 0.088787 0.118906 0.103450 0.109794 0.107763 0.096642 0.084071 0.088819 0.095643 0.084383 0.092107 0.106753
qa: -0.0686 -0.4328 0.7151 -0.3554 -0.2271 -0.3467 -0.3333 -0.4409 -0.0446 0.2395 0.0378 0.3161 -0.2219 -0.1009 -0.2205 0.0033 -0.2259 0.3616 0.0449 0.0365 -0.2460 -0.2455 0.1483 0.1605 0.1510 0.1185 0.0888 0.1189 0.1034 0.1098 0.1078 0.0966 0.0841 0.0888 0.0956 0.0844 0.0921 0.1068
va: 1.2644 2.0280 5.5331 2.0933 2.2062 2.0900 2.0643 2.0717 3.7721 3.9024 3.6966 3.7158 4.0691 3.8958 4.0934 3.6760 3.9403 4.3882 3.8289 3.8463 3.9563 3.8977 1.0158 0.9922 1.0119 0.9951 1.0237 0.9949 0.9995 0.9911 0.9919 1.0116 1.0109 1.0033 1.0064 1.0158 1.0039 1.0097
dispcorr: -0.019019442 hartree
energy: -2119.264278142343
dipole: -31.17387 29.63950 -1.53436 -4.11530 4.13400 0.01871 0.93621 -0.07046 0.86575
magnitude: 1.76186 au
magnitude: 4.47829 debye
