program: Orca
programVersion: 5.0.2
elementType: Cl S P O O O O O C C C C C C C C C C C C C C H H H H H H H H H H H H H H H H
charge: 0
multiplicity: 1
keywords: wb97x-d3
keywords: def2-TZVPP
keywords: def2/J RIJCOSX
keywords: DEFGRID2
keywords: scfconv7
keywords: smallprint printgap noloewdin
keywords: NOSOSCF
formula: C14H16ClO5PS
InChI: InChI=1/C14H16ClO5PS/c1-4-17-21(22,18-5-2)20-10-6-7-11-9(3)13(15)14(16)19-12(11)8-10/h6-8H,4-5H2,1-3H3
38 atoms
Cl 6.242749 -0.31605 0.374266
S  -3.207147 2.117063 0.990455
P  -3.050937 0.48991 -0.004326
O  -1.65508 0.22003 -0.791444
O  2.898149 -0.199673 -1.656794
O  -3.157971 -0.87556 0.806109
O  -4.070251 0.431938 -1.212125
O  4.992768 -0.414271 -2.259118
C  2.243288 0.004564 0.634257
C  1.926492 -0.059005 -0.721266
C  3.630708 -0.071063 1.037191
C  -0.398298 0.153457 -0.262204
C  0.625354 0.016514 -1.183903
C  1.182379 0.141438 1.533863
C  -0.12583 0.213952 1.104893
C  4.554651 -0.211265 0.058995
C  3.962157 0.011623 2.485687
C  4.211099 -0.285838 -1.35143
C  -4.038827 -1.033535 1.93999
C  -4.15822 -0.669144 -2.152274
C  -5.493464 -1.064126 1.542601
C  -5.591926 -0.7975 -2.593865
H  0.414196 -0.033059 -2.244142
H  1.379105 0.191728 2.595374
H  -0.908254 0.322812 1.84163
H  5.028645 -0.046879 2.676463
H  3.474906 -0.797091 3.031755
H  3.593144 0.949345 2.903001
H  -3.841057 -0.235043 2.657287
H  -3.737419 -1.976381 2.391106
H  -3.813031 -1.59511 -1.690408
H  -3.503777 -0.440517 -2.993636
H  -5.692825 -1.844454 0.807776
H  -6.091562 -1.279466 2.428678
H  -5.833222 -0.107916 1.144204
H  -5.663664 -1.592521 -3.335886
H  -5.953627 0.121643 -3.05451
H  -6.245445 -1.054436 -1.76032
elementType: Cl S P O C H
totalener: -2119.24544341 hartree
nucrepener: 2277.93048788 hartree
electener: -4397.17593128 hartree
oneelecener: -7442.80101829 hartree
twoeener: 3045.62508700 hartree
cpcmener: -0.03917983 hartree
kineticenergy: 2113.24583817 hartree
xcener: -143.911997542326 hartree
chargesum: 0.0000000
charge: -0.070371 -0.427523 0.699099 -0.299859 -0.227452 -0.333931 -0.344253 -0.442709 -0.051963 0.234194 0.032278 0.324326 -0.233387 -0.140615 -0.166853 0.002098 -0.225632 0.361595 0.043024 0.021765 -0.251421 -0.239368 0.146868 0.159518 0.119164 0.088570 0.118419 0.117992 0.096085 0.113320 0.113031 0.112398 0.092579 0.106525 0.083897 0.092713 0.090664 0.085215
qa: -0.0704 -0.4275 0.6991 -0.2999 -0.2275 -0.3339 -0.3443 -0.4427 -0.0520 0.2342 0.0323 0.3243 -0.2334 -0.1406 -0.1669 0.0021 -0.2256 0.3616 0.0430 0.0218 -0.2514 -0.2394 0.1469 0.1595 0.1192 0.0886 0.1184 0.1180 0.0961 0.1133 0.1130 0.1124 0.0926 0.1065 0.0839 0.0927 0.0907 0.0852
va: 1.2622 2.0138 5.5398 2.1744 2.2043 2.0533 2.1144 2.0695 3.7722 3.9259 3.7002 3.7630 4.0367 3.9939 3.9855 3.6684 3.9451 4.3888 3.8228 3.8361 3.9189 3.9484 1.0155 0.9935 1.0335 1.0240 0.9951 0.9952 1.0108 0.9907 0.9962 0.9958 1.0026 1.0106 1.0150 1.0066 1.0033 1.0050
dispcorr: -0.018635773 hartree
energy: -2119.264079180788
dipole: -40.68579 37.78587 -2.89992 -9.10295 7.25063 -1.85232 6.49968 -4.18713 2.31255
magnitude: 4.14590 au
magnitude: 10.53804 debye
