program: Gaussian 09
title: 000065468
version: EM64L-G09RevD.01
frameworkgroup: C1[X(C26H26N2)]
method: RPBEPBE
basis: SDD
operation: Freq
keyword: #pfreq=noraman
keyword: PBEPBE/SDD
title: #p freq=noraman PBEPBE/SDD
converged: YES YES NO NO
title: Mulliken charges:
elementType: N N C C C C C C C C C C C C C C C C C C C C C C C C C C H H H H H H H H H H H H H H H H H H H H H H H H H H
charge: -0.350401 -0.106904 -0.043250 0.410542 0.449976 0.338454 -0.539791 0.201918 -0.594430 -0.520626 0.374557 -0.589425 -0.381991 -0.451707 -0.464345 -0.319962 -0.243175 -0.415144 -0.487034 -0.262740 -0.251818 -0.638850 0.450754 -0.375751 -0.451948 -0.224893 -0.219687 -0.246750 0.235867 0.222084 0.233173 0.216231 0.217335 0.260977 0.255877 0.188254 0.229567 0.224862 0.239994 0.258094 0.220287 0.234735 0.224023 0.197520 0.231520 0.229828 0.247724 0.189793 0.227471 0.263933 0.231023 0.223823 0.223871 0.226558
chargesum: 0.00000
title: Mulliken charges with hydrogens summed into heavy atoms:
elementType: N N C C C C C C C C C C C C C C C C C C C C C C C C C C
charge: -0.350401 -0.106904 -0.043250 0.410542 0.449976 0.338454 -0.081840 0.201918 -0.145026 -0.042314 0.374557 -0.333547 0.035830 -0.226845 -0.224351 -0.061868 -0.022888 -0.180409 -0.065492 -0.031220 -0.021990 0.026137 0.450754 -0.111818 -0.220925 -0.001070 0.004184 -0.020192
polarizability: 3.81072420e+02 3.55895468e+01 3.38874546e+02 -3.07820095e+01 1.96331642e+01 1.73353941e+02
1716.lowfreq: -10.8244 -5.0106 -4.1080 -0.0005 0.0005 0.0010 9.2914 17.0046 22.4783
frequency: 8.2808 16.8560 22.4684 37.7157 52.3411 66.7128 88.6671 112.2571 115.9717 139.8348 156.4453 166.7951 177.1138 211.0109 228.3222 250.2311 263.9936 300.1743 309.6879 313.7658 331.6319 343.4280 357.9238 371.4501 399.9257 406.4087 452.7895 454.6985 477.5110 478.3773 485.4219 529.2878 544.5555 567.3030 570.4064 588.1026 596.6852 611.2233 616.5891 625.6227 658.9381 669.5542 705.5197 735.1336 742.3249 748.4358 759.8914 765.3328 777.1681 779.2547 792.7912 806.6301 821.5833 848.3106 860.6899 868.1308 887.2120 892.9778 913.3853 915.2642 940.7307 950.2854 961.6666 978.0837 981.2287 983.6441 984.5313 989.9654 1001.5723 1014.7442 1021.3384 1025.1758 1027.8317 1049.9370 1054.4153 1056.0364 1069.4649 1079.3789 1108.3800 1114.9947 1125.6266 1148.3803 1156.1317 1169.2828 1173.3878 1176.0057 1179.6579 1184.8437 1186.9536 1205.5914 1211.0434 1215.5571 1225.6235 1253.9204 1259.3440 1275.6094 1290.0731 1294.5026 1306.7890 1312.5091 1318.6123 1326.1012 1348.4075 1355.1041 1358.5300 1374.0491 1380.0941 1387.6053 1404.9095 1431.5503 1431.7679 1441.3697 1441.7540 1459.3511 1461.2469 1463.0344 1470.1964 1472.1613 1475.5622 1480.2680 1482.1873 1483.7916 1490.9576 1561.9026 1586.9422 1594.2411 1602.2412 1610.6516 1613.2816 1614.3850 2842.3751 2863.0530 2878.2275 2966.0663 2975.9989 2992.6048 3001.0584 3030.6057 3035.0993 3038.9943 3055.3144 3061.3768 3088.7280 3110.6786 3117.3769 3122.2856 3123.0068 3133.6822 3135.4070 3138.1051 3146.9932 3156.7340 3158.4475 3161.2363 3175.2208 3210.0662
redmass: 4.4281 4.7120 4.1432 3.7676 4.3863 4.8253 3.3864 4.0352 3.9223 2.6292 2.9030 3.3326 3.5812 1.5543 3.7223 1.9497 2.8758 3.8070 3.3796 3.9706 3.2588 2.5767 4.6013 3.4052 3.7162 2.8581 3.1394 2.9728 3.4160 3.1184 4.0796 3.6458 4.2030 4.4030 3.1526 4.2594 4.0542 4.6564 6.1978 4.5807 4.8096 5.3165 2.2109 3.7840 1.5493 2.3426 1.4754 1.3749 2.1156 2.5451 2.0049 3.3328 1.7289 3.7851 1.2583 1.3590 1.6521 2.2411 2.6386 1.5265 1.6355 1.9085 1.3465 1.8138 1.6503 1.4234 3.0743 5.9186 1.3783 2.4571 2.5218 2.1518 1.9000 2.2552 2.6733 3.1614 2.0139 1.5339 1.7590 1.4847 1.8527 1.4154 1.2452 1.0625 1.3609 1.0651 1.1117 1.5990 1.6674 2.0527 1.9395 1.9864 1.6800 1.6753 1.5536 1.6306 1.2232 1.4536 2.0994 1.5583 1.3678 2.6522 1.7174 2.2016 1.6072 1.9344 5.8770 4.1742 3.3257 1.4880 2.4689 1.9290 2.5217 1.1163 1.1188 1.1395 1.0969 1.2236 1.0990 2.6703 2.0736 1.0785 2.5937 6.2897 7.1353 6.1838 6.9383 6.7951 7.4554 6.1334 1.0715 1.0598 1.0667 1.0671 1.0627 1.0614 1.0848 1.0734 1.0987 1.0870 1.1013 1.0950 1.1010 1.0872 1.0867 1.0861 1.0870 1.0903 1.0915 1.0892 1.0953 1.0992 1.0954 1.1013 1.0975 1.0974
irintensity: 0.1493 0.0016 0.1054 0.1536 0.1792 0.3114 0.1845 0.8494 0.8122 1.2000 3.3892 0.8252 2.2936 0.3923 1.3853 4.0687 2.1156 0.7391 1.1745 0.9652 6.3201 0.7563 2.5255 0.2085 4.5038 0.3188 1.5847 9.4461 1.9844 4.9697 1.4550 0.0511 1.3864 0.3041 5.0252 3.9809 3.9601 7.6443 0.7647 1.6852 11.2832 2.2084 29.4723 8.0477 45.9634 45.9802 33.0279 60.1618 3.7530 1.0897 3.9123 4.2497 54.9653 10.6212 0.1330 1.3315 5.9819 3.7887 8.6410 0.5274 3.1310 1.9683 1.9182 17.3645 0.2058 1.4824 0.5233 0.2638 3.0722 21.4153 6.0123 4.0230 15.1774 28.2421 43.3479 18.8886 11.0260 6.9540 12.4812 4.8355 30.0019 10.7075 9.3469 0.3930 3.7802 0.2616 3.0688 5.2068 0.6408 2.1441 8.0819 22.3339 0.8736 10.3449 2.7410 4.1047 5.8682 6.4471 8.4268 4.2291 2.7266 64.7212 34.0951 17.7202 12.8806 63.4839 11.4673 2.6601 30.4831 7.6993 31.7931 19.6807 47.8670 1.8958 4.4107 13.8553 19.3684 10.1079 12.4780 26.2131 19.8108 4.0421 95.3741 30.4462 12.0593 0.6887 0.1255 19.3040 6.5394 8.3818 61.5025 83.6164 146.3248 35.0737 29.7160 22.3690 26.8897 27.1954 34.3289 13.5664 31.9808 18.4312 35.5302 8.9657 6.2306 0.1402 7.3830 17.0305 19.7624 10.6009 32.8945 46.3798 29.4953 29.6434 11.3021 8.3260
temp: 298.150 k
press: 1.00000 atm
elementType: 7 7 6 6 6 6 6 6 6 6 6 6 6 6 6 6 6 6 6 6 6 6 6 6 6 6 6 6 1 1 1 1 1 1 1 1 1 1 1 1 1 1 1 1 1 1 1 1 1 1 1 1 1 1
symmnumber: 1
zpe: 1179408.8 jmol-1
zpe.correction: 0.449213 hartree
zpe.thermalcorrener: 0.472847 hartree
zpe.thermalcorrenthalpy: 0.473791 hartree
zpe.thermalcorrgfe: 0.393123 hartree
zpe.sumelectzpe: -1113.895322 hartree
zpe.sumelectthermal: -1113.871689 hartree
zpe.sumelectthermalent: -1113.870744 hartree
zpe.sumelectthermalfe: -1113.951413 hartree
dipole: 0.6350 0.7059 0.6161
dipole: 1.1319
quadrupole: -157.1574 -151.3570 -168.0838
quadrupole: -8.3091 -7.9980 2.5488
quadrupole: 1.7087 7.5091 -9.2178 -8.3091 -7.9980 2.5488
hfenergy: -1114.3445353 hartree
pointgroup: C01 [X(C26H26N2)]
dipole: -0.2488781 -0.2667308 0.255387 debye
polarizability: 381.3304224|36.783036|336.8097769|28.3408565|-26.9775101|175.1607078 unknown
InChI: InChI=1S/C26H26N2/c1-27(19-20-8-3-2-4-9-20)17-16-24-18-23-12-7-11-22-15-14-21-10-5-6-13-25(21)28(24)26(22)23/h2-13,18H,14-17,19H2,1H3
charge 0 multiplicity 1
54 atoms
N  1.962651 0.081167 -0.192235
N  -2.772198 1.225006 0.842587
C  3.171931 0.832343 -0.284735
C  0.864945 0.97644 -0.403386
C  4.520663 0.452621 -0.057389
C  2.811963 2.184175 -0.619644
C  4.928342 -0.916592 0.465583
C  1.856404 -1.353605 -0.18206
C  3.859936 -1.540475 1.414185
C  -0.579072 0.577407 -0.200251
C  2.718808 -2.152575 0.625068
C  1.369994 2.244667 -0.672662
C  -1.374452 1.649114 0.590963
C  5.49694 1.460202 -0.244505
C  3.818842 3.164234 -0.805051
C  0.895789 -1.982073 -1.018323
C  5.162985 2.786659 -0.632057
C  2.552741 -3.558697 0.598689
C  -3.649518 1.365543 -0.343609
C  0.741124 -3.38269 -1.01903
C  1.566562 -4.181394 -0.196864
C  -3.358166 1.858022 2.044192
C  -4.922091 0.525505 -0.259028
C  -4.895056 -0.767534 0.321929
C  -6.138657 1.005895 -0.802894
C  -6.060092 -1.565272 0.3521
C  -7.305771 0.207671 -0.778555
C  -7.270019 -1.082241 -0.200992
H  5.116062 -1.626108 -0.364897
H  5.885614 -0.809814 1.009277
H  3.497044 -0.755118 2.105019
H  4.333833 -2.326506 2.029306
H  -1.078907 0.40099 -1.174253
H  -0.651592 -0.370702 0.360146
H  0.772128 3.137012 -0.85124
H  -1.32856 2.631928 0.059557
H  -0.878327 1.795503 1.567537
H  6.547747 1.206348 -0.057519
H  3.55103 4.193863 -1.066157
H  0.289423 -1.371452 -1.69228
H  5.962627 3.523662 -0.765949
H  3.216784 -4.172357 1.219341
H  -3.071151 1.041657 -1.230958
H  -3.927815 2.435677 -0.526632
H  -0.007837 -3.844097 -1.671584
H  1.456292 -5.270912 -0.188322
H  -4.363972 1.442112 2.226189
H  -3.456437 2.968994 1.95304
H  -2.731241 1.637317 2.9257
H  -3.95481 -1.120986 0.759824
H  -6.174494 2.009885 -1.245329
H  -6.026613 -2.562644 0.805968
H  -8.240177 0.593233 -1.202483
H  -8.174177 -1.701211 -0.177624
