program: Orca
programVersion: 5.0.2
elementType: Cl S P O O O O O C C C C C C C C C C C C C C H H H H H H H H H H H H H H H H
charge: 0
multiplicity: 1
keywords: wb97x-d3
keywords: def2-TZVPP
keywords: def2/J RIJCOSX
keywords: DEFGRID2
keywords: scfconv7
keywords: smallprint printgap noloewdin
keywords: NOSOSCF
formula: C14H16ClO5PS
InChI: InChI=1/C14H16ClO5PS/c1-4-17-21(22,18-5-2)20-10-6-7-11-9(3)13(15)14(16)19-12(11)8-10/h6-8H,4-5H2,1-3H3
38 atoms
Cl 5.813233 0.002468 -0.426714
S  -4.974293 0.22578 0.480153
P  -3.215325 -0.254898 -0.096671
O  -2.11874 0.564248 0.787564
O  2.042016 -0.860078 -1.027244
O  -2.780199 -1.779282 -0.012353
O  -2.823754 0.000492 -1.615014
O  3.888198 -1.563354 -1.969571
C  2.035247 0.76333 0.722796
C  1.36169 -0.089879 -0.143834
C  3.479222 0.826001 0.668918
C  -0.755667 0.567549 0.706862
C  -0.019692 -0.208809 -0.170794
C  1.25535 1.526125 1.60134
C  -0.11647 1.434012 1.596995
C  4.103131 0.038032 -0.237102
C  4.190974 1.744407 1.599274
C  3.387771 -0.846889 -1.13985
C  -3.200203 -2.650588 1.061134
C  -3.306797 1.145198 -2.353455
C  -2.549264 -2.312075 2.379925
C  -2.723461 2.449266 -1.867239
H  -0.461769 -0.89809 -0.875643
H  1.72949 2.20411 2.297121
H  -0.706058 2.031877 2.278758
H  3.955784 1.490402 2.633757
H  3.862696 2.772244 1.438539
H  5.269084 1.711334 1.480728
H  -2.911823 -3.645659 0.72888
H  -4.288994 -2.622112 1.136196
H  -4.397422 1.158779 -2.310476
H  -3.012086 0.946877 -3.381569
H  -2.896511 -1.36094 2.783609
H  -2.808478 -3.086109 3.10313
H  -1.461996 -2.284367 2.296853
H  -1.633052 2.426397 -1.863679
H  -3.074768 2.714853 -0.870031
H  -3.03844 3.243983 -2.544389
elementType: Cl S P O C H
totalener: -2119.24400831 hartree
nucrepener: 2337.03467505 hartree
electener: -4456.27868336 hartree
oneelecener: -7561.01199488 hartree
twoeener: 3104.73331152 hartree
cpcmener: -0.03644194 hartree
kineticenergy: 2113.23874441 hartree
xcener: -143.912093413615 hartree
chargesum: 0.0000000
charge: -0.070544 -0.417046 0.668407 -0.295615 -0.227480 -0.335356 -0.336359 -0.443925 -0.071530 0.190868 0.057406 0.241052 -0.091361 -0.110619 -0.190155 -0.011339 -0.226858 0.355496 0.032188 0.032401 -0.248673 -0.249605 0.124348 0.159872 0.147385 0.118133 0.118891 0.087861 0.112573 0.097934 0.098621 0.113085 0.086130 0.107909 0.090449 0.090811 0.085925 0.108719
qa: -0.0705 -0.4170 0.6684 -0.2956 -0.2275 -0.3354 -0.3364 -0.4439 -0.0715 0.1909 0.0574 0.2411 -0.0914 -0.1106 -0.1902 -0.0113 -0.2269 0.3555 0.0322 0.0324 -0.2487 -0.2496 0.1243 0.1599 0.1474 0.1181 0.1189 0.0879 0.1126 0.0979 0.0986 0.1131 0.0861 0.1079 0.0904 0.0908 0.0859 0.1087
va: 1.2621 2.0398 5.5226 2.0984 2.2064 2.0946 2.0923 2.0701 3.7848 4.0552 3.6791 3.7693 3.8816 3.8989 4.0265 3.6800 3.9422 4.3977 3.8465 3.8427 3.8986 3.8954 1.0472 0.9914 1.0077 0.9951 0.9950 1.0241 0.9917 1.0095 1.0097 0.9920 1.0145 1.0091 1.0046 1.0045 1.0157 1.0091
dispcorr: -0.019806189 hartree
energy: -2119.263814498494
dipole: -19.28566 18.82991 -0.45576 6.52015 -4.70541 1.81474 8.49577 -6.44986 2.04591
magnitude: 2.77250 au
magnitude: 7.04714 debye
