program: Orca
programVersion: 5.0.2
elementType: Cl S P O O O O O C C C C C C C C C C C C C C H H H H H H H H H H H H H H H H
charge: 0
multiplicity: 1
keywords: wb97x-d3
keywords: def2-TZVPP
keywords: def2/J RIJCOSX
keywords: DEFGRID2
keywords: scfconv7
keywords: smallprint printgap noloewdin
keywords: NOSOSCF
formula: C14H16ClO5PS
InChI: InChI=1/C14H16ClO5PS/c1-4-17-21(22,18-5-2)20-10-6-7-11-9(3)13(15)14(16)19-12(11)8-10/h6-8H,4-5H2,1-3H3
38 atoms
Cl 6.177022 0.698047 0.265554
S  -3.039533 0.068526 1.840234
P  -3.041295 -0.369568 -0.026317
O  -1.618411 -0.847692 -0.643667
O  2.980824 -1.487347 -0.311345
O  -3.959322 -1.57358 -0.498339
O  -3.411373 0.773044 -1.066778
O  5.111818 -1.977358 -0.212231
C  2.167712 0.74296 -0.027397
C  1.947417 -0.612278 -0.259434
C  3.524126 1.214035 0.150433
C  -0.398888 -0.277627 -0.407628
C  0.6814 -1.138756 -0.441406
C  1.047663 1.579704 0.007429
C  -0.22554 1.087877 -0.183586
C  4.51449 0.295407 0.081501
C  3.751585 2.6633 0.398518
C  4.269813 -1.11811 -0.149532
C  -4.436427 -2.616104 0.383472
C  -4.60536 1.57307 -0.886106
C  -5.850808 -2.330957 0.815651
C  -4.248682 2.946711 -0.381242
H  0.543751 -2.198097 -0.615836
H  1.170089 2.639556 0.180292
H  -1.059921 1.774713 -0.174891
H  3.238898 2.972118 1.310795
H  3.337974 3.255686 -0.418463
H  4.802386 2.913875 0.499681
H  -3.772999 -2.716261 1.243419
H  -4.375565 -3.535877 -0.19564
H  -5.303834 1.075791 -0.208968
H  -5.077374 1.620036 -1.866078
H  -6.212874 -3.159681 1.424556
H  -5.910055 -1.42272 1.415685
H  -6.517485 -2.229538 -0.040617
H  -3.565961 3.456715 -1.06077
H  -3.793742 2.903815 0.607942
H  -5.156627 3.545921 -0.307858
elementType: Cl S P O C H
totalener: -2119.24401418 hartree
nucrepener: 2280.41153051 hartree
electener: -4399.65554469 hartree
oneelecener: -7448.16700104 hartree
twoeener: 3048.51145635 hartree
cpcmener: -0.03646591 hartree
kineticenergy: 2113.26472394 hartree
xcener: -143.915117628825 hartree
chargesum: -0.0000000
charge: -0.070215 -0.441348 0.751052 -0.319712 -0.227474 -0.352939 -0.345372 -0.442780 -0.034420 0.224877 0.029825 0.261275 -0.203116 -0.134859 -0.159741 0.005374 -0.226178 0.359667 0.053754 0.045040 -0.240817 -0.245291 0.146002 0.158502 0.142260 0.119520 0.117623 0.088558 0.088257 0.109329 0.092047 0.109040 0.099327 0.076912 0.091497 0.091751 0.076294 0.106481
qa: -0.0702 -0.4413 0.7511 -0.3197 -0.2275 -0.3529 -0.3454 -0.4428 -0.0344 0.2249 0.0298 0.2613 -0.2031 -0.1349 -0.1597 0.0054 -0.2262 0.3597 0.0538 0.0450 -0.2408 -0.2453 0.1460 0.1585 0.1423 0.1195 0.1176 0.0886 0.0883 0.1093 0.0920 0.1090 0.0993 0.0769 0.0915 0.0918 0.0763 0.1065
va: 1.2623 1.9726 5.5000 2.1620 2.2046 2.1068 2.0862 2.0695 3.7539 3.9418 3.7044 3.8116 4.0354 3.9658 3.9727 3.6705 3.9442 4.3903 3.8287 3.8744 3.9180 3.9103 1.0160 0.9953 1.0067 0.9947 0.9954 1.0238 1.0153 0.9962 0.9995 0.9968 1.0090 1.0154 1.0038 1.0027 1.0177 1.0088
dispcorr: -0.018317977 hartree
energy: -2119.262332158160
dipole: -40.85014 37.29344 -3.55670 9.79135 -7.41370 2.37765 0.72964 -1.03214 -0.30250
magnitude: 4.28892 au
magnitude: 10.90157 debye
