program: Orca
programVersion: 5.0.2
elementType: Cl S P O O O O O C C C C C C C C C C C C C C H H H H H H H H H H H H H H H H
charge: 0
multiplicity: 1
keywords: wb97x-d3
keywords: def2-TZVPP
keywords: def2/J RIJCOSX
keywords: DEFGRID2
keywords: scfconv7
keywords: smallprint printgap noloewdin
keywords: NOSOSCF
formula: C14H16ClO5PS
InChI: InChI=1/C14H16ClO5PS/c1-4-17-21(22,18-5-2)20-10-6-7-11-9(3)13(15)14(16)19-12(11)8-10/h6-8H,4-5H2,1-3H3
38 atoms
Cl 5.859993 0.064268 -1.012438
S  -4.584096 -0.398595 1.615424
P  -3.015227 -0.068163 0.570815
O  -1.747175 0.245466 1.526798
O  2.461759 -1.422512 0.235697
O  -2.535185 -1.210882 -0.429834
O  -2.996184 1.209897 -0.373273
O  4.373385 -2.342239 -0.30503
C  2.105165 0.939843 0.133735
C  1.650416 -0.348726 0.400982
C  3.464991 1.12235 -0.330208
C  -0.481184 0.468531 1.027281
C  0.363202 -0.606649 0.843715
C  1.213133 1.999607 0.335311
C  -0.07263 1.773979 0.775322
C  4.22771 0.014792 -0.471367
C  3.938019 2.500799 -0.627504
C  3.739563 -1.32469 -0.188719
C  -2.748519 -2.616744 -0.165074
C  -3.993183 1.389152 -1.405205
C  -3.92585 -3.125652 -0.95469
C  -4.120761 2.861152 -1.688366
H  0.044066 -1.619249 1.055139
H  1.52764 3.015789 0.144527
H  -0.7494 2.600916 0.939115
H  4.968024 2.528941 -0.967067
H  3.855191 3.128754 0.260641
H  3.313049 2.952903 -1.398928
H  -2.888447 -2.786336 0.903799
H  -1.826259 -3.115115 -0.460431
H  -4.947553 0.975277 -1.071397
H  -3.673809 0.838664 -2.290862
H  -3.783936 -2.974635 -2.024773
H  -4.039459 -4.195907 -0.780241
H  -4.850893 -2.635864 -0.651038
H  -3.174221 3.290842 -2.015955
H  -4.470584 3.407238 -0.812539
H  -4.847533 3.00691 -2.487277
elementType: Cl S P O C H
totalener: -2119.24525680 hartree
nucrepener: 2304.53428770 hartree
electener: -4423.77954450 hartree
oneelecener: -7496.00771282 hartree
twoeener: 3072.22816831 hartree
cpcmener: -0.03869445 hartree
kineticenergy: 2113.26625508 hartree
xcener: -143.910870242977 hartree
chargesum: 0.0000000
charge: -0.068145 -0.435088 0.722726 -0.353042 -0.226687 -0.345046 -0.331422 -0.441766 -0.044484 0.235496 0.035694 0.291719 -0.218785 -0.098803 -0.210571 0.003957 -0.224644 0.362396 0.057114 0.039282 -0.238631 -0.238054 0.156694 0.160882 0.152675 0.088329 0.118165 0.119450 0.092820 0.108770 0.090289 0.107566 0.090661 0.097417 0.076208 0.089544 0.087022 0.090292
qa: -0.0681 -0.4351 0.7227 -0.3530 -0.2267 -0.3450 -0.3314 -0.4418 -0.0445 0.2355 0.0357 0.2917 -0.2188 -0.0988 -0.2106 0.0040 -0.2246 0.3624 0.0571 0.0393 -0.2386 -0.2381 0.1567 0.1609 0.1527 0.0883 0.1182 0.1194 0.0928 0.1088 0.0903 0.1076 0.0907 0.0974 0.0762 0.0895 0.0870 0.0903
va: 1.2646 2.0067 5.5295 2.1260 2.2080 2.0632 2.1082 2.0703 3.7710 3.9201 3.6973 3.7744 4.0464 3.8697 4.0533 3.6756 3.9408 4.3865 3.8124 3.8339 3.9413 3.9554 1.0065 0.9916 1.0072 1.0239 0.9953 0.9949 1.0092 0.9934 1.0061 0.9960 1.0039 1.0088 1.0172 1.0034 1.0060 1.0073
dispcorr: -0.018483795 hartree
energy: -2119.263740595708
dipole: -28.97224 27.84703 -1.12521 7.82630 -5.38031 2.44599 -10.28357 8.82184 -1.46173
magnitude: 3.06359 au
magnitude: 7.78704 debye
