program: Orca
programVersion: 5.0.2
elementType: Cl S P O O O O O C C C C C C C C C C C C C C H H H H H H H H H H H H H H H H
charge: 0
multiplicity: 1
keywords: wb97x-d3
keywords: def2-TZVPP
keywords: def2/J RIJCOSX
keywords: DEFGRID2
keywords: scfconv7
keywords: smallprint printgap noloewdin
keywords: NOSOSCF
formula: C14H16ClO5PS
InChI: InChI=1/C14H16ClO5PS/c1-4-17-21(22,18-5-2)20-10-6-7-11-9(3)13(15)14(16)19-12(11)8-10/h6-8H,4-5H2,1-3H3
38 atoms
Cl 5.932582 -0.01369 0.322203
S  -2.423652 1.734084 1.385698
P  -3.051913 0.290597 0.298584
O  -1.995444 -0.254284 -0.822807
O  2.386324 1.417254 -0.504747
O  -3.449577 -0.991512 1.140392
O  -4.316989 0.537354 -0.62717
O  4.368082 2.340912 -0.384917
C  2.029303 -0.904983 -0.051978
C  1.549804 0.356029 -0.398582
C  3.447316 -1.074053 0.185676
C  -0.670757 -0.458501 -0.538843
C  0.209887 0.59892 -0.646394
C  1.101731 -1.948877 0.044748
C  -0.239331 -1.733877 -0.187726
C  4.231509 0.021269 0.069496
C  3.959381 -2.425617 0.539983
C  3.714756 1.334745 -0.279126
C  -4.059591 -2.171684 0.560423
C  -4.541329 1.776071 -1.336581
C  -3.770241 -3.339293 1.465554
C  -3.584765 1.985148 -2.485547
H  -0.130416 1.588304 -0.92292
H  1.432328 -2.942935 0.3105
H  -0.948323 -2.548022 -0.113188
H  3.731592 -3.135035 -0.256878
H  3.470002 -2.789972 1.44421
H  5.031352 -2.438365 0.708144
H  -3.664456 -2.353934 -0.44029
H  -5.132382 -1.995246 0.477515
H  -4.491457 2.604564 -0.627787
H  -5.565391 1.70234 -1.695984
H  -4.157522 -3.17285 2.470932
H  -4.256526 -4.228073 1.064111
H  -2.70086 -3.540939 1.530021
H  -3.904741 2.865663 -3.043227
H  -3.584677 1.138608 -3.171788
H  -2.56348 2.167886 -2.150948
elementType: Cl S P O C H
totalener: -2119.24545725 hartree
nucrepener: 2315.32693179 hartree
electener: -4434.57238904 hartree
oneelecener: -7517.95972453 hartree
twoeener: 3083.38733549 hartree
cpcmener: -0.04153908 hartree
kineticenergy: 2113.26335120 hartree
xcener: -143.912005742057 hartree
chargesum: 0.0000000
charge: -0.068835 -0.429601 0.723303 -0.359272 -0.226934 -0.350777 -0.332658 -0.441865 -0.044424 0.225007 0.040146 0.310571 -0.201333 -0.105441 -0.205315 0.000759 -0.225525 0.361799 0.006334 0.029619 -0.240568 -0.233610 0.137868 0.159939 0.167833 0.119406 0.117649 0.088869 0.116695 0.116793 0.093252 0.110797 0.092311 0.092119 0.083887 0.101723 0.091892 0.077582
qa: -0.0688 -0.4296 0.7233 -0.3593 -0.2269 -0.3508 -0.3327 -0.4419 -0.0444 0.2250 0.0401 0.3106 -0.2013 -0.1054 -0.2053 0.0008 -0.2255 0.3618 0.0063 0.0296 -0.2406 -0.2336 0.1379 0.1599 0.1678 0.1194 0.1176 0.0889 0.1167 0.1168 0.0933 0.1108 0.0923 0.0921 0.0839 0.1017 0.0919 0.0776
va: 1.2643 2.0172 5.5222 2.0502 2.2084 2.1181 2.0989 2.0705 3.7659 3.9738 3.6925 3.7455 4.0482 3.8976 4.0898 3.6779 3.9417 4.3872 3.8407 3.8553 3.9509 3.8952 1.0204 0.9937 0.9894 0.9949 0.9950 1.0239 0.9897 0.9973 1.0090 0.9899 1.0036 1.0062 1.0060 1.0096 1.0067 1.0074
dispcorr: -0.019180631 hartree
energy: -2119.264637883743
dipole: -31.05123 28.42989 -2.62134 -16.26092 12.19607 -4.06484 -5.06825 3.89886 -1.16940
magnitude: 4.97613 au
magnitude: 12.64832 debye
