program: Orca
programVersion: 5.0.2
elementType: Cl S P O O O O O C C C C C C C C C C C C C C H H H H H H H H H H H H H H H H
charge: 0
multiplicity: 1
keywords: wb97x-d3
keywords: def2-TZVPP
keywords: def2/J RIJCOSX
keywords: DEFGRID2
keywords: scfconv7
keywords: smallprint printgap noloewdin
keywords: NOSOSCF
formula: C14H16ClO5PS
InChI: InChI=1/C14H16ClO5PS/c1-4-17-21(22,18-5-2)20-10-6-7-11-9(3)13(15)14(16)19-12(11)8-10/h6-8H,4-5H2,1-3H3
38 atoms
Cl 5.942681 0.11766 -0.948955
S  -4.55993 -0.230151 1.631704
P  -2.934955 -0.228248 0.620309
O  -1.688589 0.263322 1.536458
O  2.614992 -1.34945 0.495705
O  -2.387989 -1.614699 0.068659
O  -2.87057 0.677845 -0.688429
O  4.569441 -2.242812 0.077325
C  2.139415 0.953045 0.061287
C  1.749237 -0.306196 0.509409
C  3.49212 1.137612 -0.422762
C  -0.429478 0.477178 1.01512
C  0.474092 -0.565429 0.985526
C  1.191481 1.981827 0.111663
C  -0.083798 1.753183 0.580938
C  4.309993 0.060535 -0.410594
C  3.902695 2.484883 -0.901971
C  3.887691 -1.24999 0.056434
C  -3.267606 -2.652032 -0.421676
C  -3.50257 1.976711 -0.762683
C  -3.937149 -2.288505 -1.723248
C  -4.790898 1.888881 -1.539381
H  0.20959 -1.553831 1.33734
H  1.454086 2.975948 -0.221277
H  -0.803976 2.559167 0.624884
H  3.797102 3.21819 -0.10125
H  3.257437 2.807861 -1.720022
H  4.929629 2.512182 -1.251224
H  -4.003412 -2.885945 0.349669
H  -2.622599 -3.519353 -0.545357
H  -2.782781 2.624808 -1.260285
H  -3.673359 2.377649 0.237922
H  -4.48902 -3.157596 -2.082188
H  -4.652296 -1.473179 -1.610294
H  -3.210239 -2.01563 -2.487726
H  -5.218502 2.887092 -1.636454
H  -5.520649 1.258404 -1.032193
H  -4.625124 1.497495 -2.54305
elementType: Cl S P O C H
totalener: -2119.24451340 hartree
nucrepener: 2312.22454740 hartree
electener: -4431.46906080 hartree
oneelecener: -7511.50654729 hartree
twoeener: 3080.03748648 hartree
cpcmener: -0.03947828 hartree
kineticenergy: 2113.24796231 hartree
xcener: -143.909706601733 hartree
chargesum: 0.0000000
charge: -0.068104 -0.432624 0.724699 -0.355515 -0.227317 -0.334941 -0.342967 -0.441072 -0.037493 0.230104 0.036898 0.275011 -0.205305 -0.102294 -0.208576 0.002491 -0.224394 0.362748 0.027685 0.051308 -0.233884 -0.252034 0.147239 0.160307 0.164260 0.118654 0.118673 0.087842 0.094724 0.110613 0.109567 0.098157 0.101682 0.076091 0.092859 0.103180 0.079187 0.092542
qa: -0.0681 -0.4326 0.7247 -0.3555 -0.2273 -0.3349 -0.3430 -0.4411 -0.0375 0.2301 0.0369 0.2750 -0.2053 -0.1023 -0.2086 0.0025 -0.2244 0.3627 0.0277 0.0513 -0.2339 -0.2520 0.1472 0.1603 0.1643 0.1187 0.1187 0.0878 0.0947 0.1106 0.1096 0.0982 0.1017 0.0761 0.0929 0.1032 0.0792 0.0925
va: 1.2647 2.0079 5.5199 2.1251 2.2065 2.1078 2.0555 2.0714 3.7692 3.9164 3.7002 3.7924 4.0714 3.8734 4.0424 3.6769 3.9414 4.3871 3.8595 3.8125 3.8931 3.9459 1.0180 0.9934 0.9941 0.9952 0.9951 1.0242 1.0087 0.9911 0.9927 1.0043 1.0101 1.0113 1.0060 1.0096 1.0140 1.0018
dispcorr: -0.019223381 hartree
energy: -2119.263736782821
dipole: -31.82900 30.33396 -1.49504 9.49347 -6.40991 3.08356 -12.85497 11.06874 -1.78624
magnitude: 3.86447 au
magnitude: 9.82269 debye
