program: Orca
programVersion: 5.0.2
elementType: Cl S P O O O O O C C C C C C C C C C C C C C H H H H H H H H H H H H H H H H
charge: 0
multiplicity: 1
keywords: wb97x-d3
keywords: def2-TZVPP
keywords: def2/J RIJCOSX
keywords: DEFGRID2
keywords: scfconv7
keywords: smallprint printgap noloewdin
keywords: NOSOSCF
formula: C14H16ClO5PS
InChI: InChI=1/C14H16ClO5PS/c1-4-17-21(22,18-5-2)20-10-6-7-11-9(3)13(15)14(16)19-12(11)8-10/h6-8H,4-5H2,1-3H3
38 atoms
Cl 5.919161 0.052128 -0.808569
S  -4.590915 -0.553833 1.355136
P  -3.04295 -0.184493 0.29177
O  -1.838249 0.396632 1.205485
O  2.535206 -1.245516 0.668358
O  -2.298198 -1.382678 -0.440318
O  -3.236769 0.852822 -0.905238
O  4.517697 -2.153527 0.49011
C  2.057925 0.955349 -0.137069
C  1.659315 -0.228379 0.479376
C  3.433243 1.092327 -0.570522
C  -0.555279 0.574547 0.730774
C  0.363242 -0.438055 0.918497
C  1.095616 1.957961 -0.298829
C  -0.203233 1.775892 0.125324
C  4.260186 0.044801 -0.353227
C  3.854006 2.361127 -1.224041
C  3.826468 -1.189767 0.28051
C  -3.026334 -2.296168 -1.297658
C  -4.252045 1.880694 -0.887498
C  -3.310708 -3.586674 -0.575253
C  -3.963282 2.982083 0.101863
H  0.08743 -1.366972 1.400421
H  1.363071 2.895187 -0.765927
H  -0.931551 2.565406 0.004584
H  3.687555 3.204727 -0.552729
H  3.255909 2.540207 -2.118575
H  4.900305 2.359758 -1.511586
H  -2.383961 -2.457879 -2.161549
H  -3.948776 -1.834065 -1.655782
H  -5.21967 1.418429 -0.686168
H  -4.268179 2.267383 -1.904445
H  -3.971643 -3.431053 0.276411
H  -3.802852 -4.275872 -1.261274
H  -2.393469 -4.060208 -0.226261
H  -4.749823 3.733105 0.023764
H  -3.013464 3.474726 -0.103081
H  -3.957795 2.622946 1.131306
elementType: Cl S P O C H
totalener: -2119.24362289 hartree
nucrepener: 2313.57280335 hartree
electener: -4432.81642624 hartree
oneelecener: -7514.29396395 hartree
twoeener: 3081.47753772 hartree
cpcmener: -0.03909261 hartree
kineticenergy: 2113.25949620 hartree
xcener: -143.912243438588 hartree
chargesum: 0.0000000
charge: -0.068353 -0.436419 0.735730 -0.352290 -0.227355 -0.337519 -0.348164 -0.440747 -0.026053 0.243692 0.033731 0.288450 -0.224175 -0.132396 -0.198949 0.002677 -0.225123 0.360798 0.029570 0.046865 -0.235325 -0.260862 0.145745 0.158708 0.177530 0.118470 0.118505 0.088712 0.109778 0.095958 0.097166 0.112107 0.074737 0.095691 0.090607 0.109583 0.094830 0.084091
qa: -0.0684 -0.4364 0.7357 -0.3523 -0.2274 -0.3375 -0.3482 -0.4407 -0.0261 0.2437 0.0337 0.2885 -0.2242 -0.1324 -0.1989 0.0027 -0.2251 0.3608 0.0296 0.0469 -0.2353 -0.2609 0.1457 0.1587 0.1775 0.1185 0.1185 0.0887 0.1098 0.0960 0.0972 0.1121 0.0747 0.0957 0.0906 0.1096 0.0948 0.0841
va: 1.2642 2.0064 5.5017 2.1100 2.2064 2.1025 2.0690 2.0717 3.7611 3.8915 3.6991 3.7794 4.0612 3.9413 4.0410 3.6758 3.9420 4.3903 3.8664 3.8209 3.9315 3.9043 1.0166 0.9961 0.9824 0.9952 0.9951 1.0238 0.9951 1.0001 1.0134 0.9933 1.0189 1.0084 1.0034 1.0096 1.0023 1.0196
dispcorr: -0.018933713 hartree
energy: -2119.262556602037
dipole: -28.90119 27.27347 -1.62772 9.03655 -5.88560 3.15095 -8.59335 6.22595 -2.36741
magnitude: 4.26411 au
magnitude: 10.83850 debye
