program: Orca
programVersion: 5.0.2
elementType: Cl S P O O O O O C C C C C C C C C C C C C C H H H H H H H H H H H H H H H H
charge: 0
multiplicity: 1
keywords: wb97x-d3
keywords: def2-TZVPP
keywords: def2/J RIJCOSX
keywords: DEFGRID2
keywords: scfconv7
keywords: smallprint printgap noloewdin
keywords: NOSOSCF
formula: C14H16ClO5PS
InChI: InChI=1/C14H16ClO5PS/c1-4-17-21(22,18-5-2)20-10-6-7-11-9(3)13(15)14(16)19-12(11)8-10/h6-8H,4-5H2,1-3H3
38 atoms
Cl 6.062845 0.810358 0.066047
S  -2.515409 0.395543 1.73284
P  -2.831555 -0.195254 -0.062069
O  -1.681153 -1.159297 -0.688357
O  2.24337 1.468891 -0.46631
O  -4.109384 -1.093986 -0.341896
O  -2.940266 0.907454 -1.199747
O  3.983238 2.795683 -0.408409
C  2.426108 -0.892421 -0.15459
C  1.665062 0.249662 -0.390329
C  3.85902 -0.759778 0.002205
C  -0.338855 -1.019027 -0.492556
C  0.291124 0.209003 -0.566261
C  1.749991 -2.116628 -0.09073
C  0.384392 -2.185094 -0.249024
C  4.380964 0.484113 -0.087703
C  4.672149 -1.982859 0.247261
C  3.571068 1.670315 -0.32728
C  -4.542351 -2.115265 0.585241
C  -3.581092 2.181863 -0.986527
C  -5.762392 -1.655342 1.341591
C  -5.083441 2.066732 -0.906036
H  -0.246198 1.125303 -0.772804
H  2.299818 -3.029366 0.091807
H  -0.128952 -3.135627 -0.191734
H  4.344776 -2.478466 1.162604
H  5.73172 -1.768087 0.342756
H  4.545022 -2.69506 -0.569391
H  -3.735387 -2.378659 1.272029
H  -4.758931 -2.99393 -0.021182
H  -3.281724 2.785944 -1.841302
H  -3.170052 2.645491 -0.087354
H  -6.576148 -1.392093 0.665483
H  -6.111266 -2.463743 1.985216
H  -5.53959 -0.796267 1.974314
H  -5.411895 1.541066 -0.008719
H  -5.494304 1.559494 -1.779053
H  -5.5107 3.069617 -0.870456
elementType: Cl S P O C H
totalener: -2119.25539975 hartree
nucrepener: 2300.39699923 hartree
electener: -4419.65239898 hartree
oneelecener: -7488.39497236 hartree
twoeener: 3068.74257338 hartree
cpcmener: -0.03045116 hartree
kineticenergy: 2113.27349806 hartree
xcener: -143.914971597618 hartree
chargesum: -0.0000000
charge: -0.066886 -0.432760 0.737411 -0.326717 -0.223103 -0.341300 -0.342970 -0.408716 -0.055802 0.215973 0.040009 0.255256 -0.168057 -0.107387 -0.195257 -0.001864 -0.231669 0.342389 0.048176 0.033602 -0.244274 -0.234003 0.138922 0.157721 0.147898 0.117268 0.089628 0.116241 0.089033 0.106453 0.110954 0.094570 0.091460 0.100169 0.078961 0.077026 0.092812 0.098832
qa: -0.0669 -0.4328 0.7374 -0.3267 -0.2231 -0.3413 -0.3430 -0.4087 -0.0558 0.2160 0.0400 0.2553 -0.1681 -0.1074 -0.1953 -0.0019 -0.2317 0.3424 0.0482 0.0336 -0.2443 -0.2340 0.1389 0.1577 0.1479 0.1173 0.0896 0.1162 0.0890 0.1065 0.1110 0.0946 0.0915 0.1002 0.0790 0.0770 0.0928 0.0988
va: 1.2664 1.9866 5.5098 2.1463 2.2125 2.1053 2.1074 2.1101 3.7628 4.0078 3.6707 3.8215 3.9803 3.8863 4.0270 3.6759 3.9420 4.4077 3.8496 3.8470 3.9212 3.9205 1.0278 0.9927 1.0052 0.9948 1.0255 0.9953 1.0096 0.9966 0.9910 1.0100 1.0025 1.0100 1.0152 1.0102 1.0056 1.0095
dispcorr: -0.018556956 hartree
energy: -2119.273956709688
dipole: -37.19355 35.16902 -2.02453 -10.68261 7.59475 -3.08787 1.74915 -1.92846 -0.17931
magnitude: 3.69673 au
magnitude: 9.39634 debye
