program: Orca
programVersion: 5.0.2
elementType: Cl S P O O O O O C C C C C C C C C C C C C C H H H H H H H H H H H H H H H H
charge: 0
multiplicity: 1
keywords: wb97x-d3
keywords: def2-TZVPP
keywords: def2/J RIJCOSX
keywords: DEFGRID2
keywords: scfconv7
keywords: smallprint printgap noloewdin
keywords: NOSOSCF
formula: C14H16ClO5PS
InChI: InChI=1/C14H16ClO5PS/c1-4-17-21(22,18-5-2)20-10-6-7-11-9(3)13(15)14(16)19-12(11)8-10/h6-8H,4-5H2,1-3H3
38 atoms
Cl 6.275762 0.171459 0.324304
S  -3.040383 1.968108 0.470423
P  -3.020337 0.147268 -0.127498
O  -1.628469 -0.370476 -0.782501
O  2.936618 -0.242544 -1.676716
O  -3.236749 -0.996322 0.955018
O  -4.031383 -0.264958 -1.275654
O  5.039046 -0.222265 -2.286913
C  2.266644 0.028964 0.599422
C  1.959603 -0.162341 -0.745947
C  3.654468 0.141809 0.994456
C  -0.372552 -0.21238 -0.278139
C  0.657177 -0.275586 -1.199967
C  1.198767 0.09329 1.499188
C  -0.108012 -0.029329 1.079255
C  4.586705 0.054587 0.019334
C  3.974511 0.349052 2.433579
C  4.251008 -0.142371 -1.383648
C  -4.359931 -0.969294 1.859751
C  -4.632966 0.667941 -2.199506
C  -4.175865 -2.079271 2.86071
C  -6.062344 0.937099 -1.80724
H  0.452596 -0.418273 -2.25354
H  1.388775 0.234838 2.553879
H  -0.898489 0.005988 1.814926
H  3.530174 1.280617 2.788584
H  5.042008 0.391678 2.625659
H  3.555568 -0.458356 3.036087
H  -5.282053 -1.102397 1.288508
H  -4.403624 0.003167 2.356418
H  -4.57105 0.195021 -3.179036
H  -4.05393 1.592304 -2.23766
H  -3.26979 -1.937297 3.451089
H  -5.024752 -2.086394 3.544956
H  -4.129212 -3.055095 2.375563
H  -6.12414 1.439491 -0.841511
H  -6.64413 0.01596 -1.760663
H  -6.523829 1.58585 -2.552975
elementType: Cl S P O C H
totalener: -2119.25549283 hartree
nucrepener: 2269.00424348 hartree
electener: -4388.25973631 hartree
oneelecener: -7425.29538787 hartree
twoeener: 3037.03565155 hartree
cpcmener: -0.02995112 hartree
kineticenergy: 2113.26584762 hartree
xcener: -143.913468250415 hartree
chargesum: 0.0000000
charge: -0.067738 -0.436186 0.736448 -0.309508 -0.224555 -0.329465 -0.343626 -0.408425 -0.046238 0.225406 0.026915 0.287707 -0.217593 -0.131753 -0.161352 0.006973 -0.230839 0.340756 0.032951 0.049436 -0.244260 -0.237756 0.143847 0.156488 0.124127 0.117918 0.089105 0.114506 0.113812 0.094859 0.107997 0.087050 0.088176 0.088870 0.089781 0.078708 0.090062 0.097396
qa: -0.0677 -0.4362 0.7364 -0.3095 -0.2246 -0.3295 -0.3436 -0.4084 -0.0462 0.2254 0.0269 0.2877 -0.2176 -0.1318 -0.1614 0.0070 -0.2308 0.3408 0.0330 0.0494 -0.2443 -0.2378 0.1438 0.1565 0.1241 0.1179 0.0891 0.1145 0.1138 0.0949 0.1080 0.0871 0.0882 0.0889 0.0898 0.0787 0.0901 0.0974
va: 1.2649 1.9882 5.5201 2.1818 2.2077 2.1046 2.1186 2.1099 3.7655 3.9511 3.6909 3.8066 4.0401 3.9649 3.9699 3.6684 3.9464 4.4098 3.8287 3.8352 3.9638 3.9188 1.0175 0.9951 1.0310 0.9948 1.0255 0.9956 0.9905 1.0052 0.9960 1.0152 1.0035 1.0066 1.0036 1.0151 1.0039 1.0094
dispcorr: -0.017681523 hartree
energy: -2119.273174352781
dipole: -40.80068 37.52362 -3.27705 -3.27947 2.86038 -0.41909 11.81379 -9.46442 2.34937
magnitude: 4.05392 au
magnitude: 10.30424 debye
