program: Orca
programVersion: 5.0.2
elementType: Cl S P O O O O O C C C C C C C C C C C C C C H H H H H H H H H H H H H H H H
charge: 0
multiplicity: 1
keywords: wb97x-d3
keywords: def2-TZVPP
keywords: def2/J RIJCOSX
keywords: DEFGRID2
keywords: scfconv7
keywords: smallprint printgap noloewdin
keywords: NOSOSCF
formula: C14H16ClO5PS
InChI: InChI=1/C14H16ClO5PS/c1-4-17-21(22,18-5-2)20-10-6-7-11-9(3)13(15)14(16)19-12(11)8-10/h6-8H,4-5H2,1-3H3
38 atoms
Cl 5.98907 0.576388 0.117672
S  -2.48295 -0.624571 2.244198
P  -2.956725 -0.091151 0.471708
O  -1.917044 -0.553643 -0.700689
O  2.194246 1.330312 0.704816
O  -4.298815 -0.651219 -0.16212
O  -3.098759 1.47622 0.302837
O  4.025134 2.283127 1.433388
C  2.229941 -0.554445 -0.758643
C  1.536047 0.391308 -0.009269
C  3.676937 -0.531128 -0.752205
C  -0.558895 -0.512361 -0.667037
C  0.151341 0.434766 0.047553
C  1.473248 -1.486849 -1.479141
C  0.09884 -1.475393 -1.433237
C  4.280106 0.421901 -0.006513
C  4.413554 -1.545552 -1.555748
C  3.541149 1.411372 0.763587
C  -4.83626 -1.957316 0.128779
C  -3.50414 2.130676 -0.925336
C  -4.074072 -3.068691 -0.54914
C  -4.940875 2.580056 -0.842326
H  -0.330943 1.205639 0.634882
H  1.967828 -2.237469 -2.079875
H  -0.476624 -2.203684 -1.989332
H  4.137238 -2.553569 -1.242756
H  5.491298 -1.45116 -1.466541
H  4.153598 -1.452901 -2.611757
H  -5.863053 -1.916245 -0.230085
H  -4.864527 -2.100681 1.210785
H  -3.343568 1.480578 -1.787302
H  -2.8345 2.983078 -1.031264
H  -3.067824 -3.188399 -0.146088
H  -4.604957 -4.006689 -0.381811
H  -4.005339 -2.912487 -1.625888
H  -5.107202 3.230192 0.016958
H  -5.632016 1.739906 -0.78332
H  -5.184708 3.148444 -1.740758
elementType: Cl S P O C H
totalener: -2119.25462961 hartree
nucrepener: 2306.96983489 hartree
electener: -4426.22446451 hartree
oneelecener: -7501.31675132 hartree
twoeener: 3075.09228681 hartree
cpcmener: -0.03230115 hartree
kineticenergy: 2113.26453435 hartree
xcener: -143.913845452795 hartree
chargesum: 0.0000000
charge: -0.067578 -0.414726 0.706249 -0.317316 -0.223987 -0.325276 -0.342752 -0.408023 -0.067796 0.208145 0.045323 0.290347 -0.156418 -0.109474 -0.202614 -0.004156 -0.231665 0.338421 0.024359 0.040616 -0.234284 -0.246307 0.126072 0.157888 0.149849 0.115370 0.089210 0.117208 0.105387 0.094609 0.100535 0.105829 0.078236 0.099741 0.090570 0.089271 0.085065 0.094072
qa: -0.0676 -0.4147 0.7062 -0.3173 -0.2240 -0.3253 -0.3428 -0.4080 -0.0678 0.2081 0.0453 0.2903 -0.1564 -0.1095 -0.2026 -0.0042 -0.2317 0.3384 0.0244 0.0406 -0.2343 -0.2463 0.1261 0.1579 0.1498 0.1154 0.0892 0.1172 0.1054 0.0946 0.1005 0.1058 0.0782 0.0997 0.0906 0.0893 0.0851 0.0941
va: 1.2651 2.0289 5.5166 2.0956 2.2109 2.1113 2.1035 2.1114 3.7895 4.0086 3.6740 3.8030 3.9670 3.8997 4.0157 3.6756 3.9430 4.4140 3.8702 3.8492 3.8888 3.9403 1.0420 0.9930 1.0031 0.9954 1.0255 0.9949 0.9907 1.0086 1.0011 0.9922 1.0160 1.0102 1.0051 1.0035 1.0119 1.0071
dispcorr: -0.018794776 hartree
energy: -2119.273424391118
dipole: -33.23904 31.01635 -2.22269 -10.36922 8.06772 -2.30150 -15.07535 11.43986 -3.63549
magnitude: 4.84294 au
magnitude: 12.30977 debye
