program: Orca
programVersion: 5.0.2
elementType: Cl S P O O O O O C C C C C C C C C C C C C C H H H H H H H H H H H H H H H H
charge: 0
multiplicity: 1
keywords: wb97x-d3
keywords: def2-TZVPP
keywords: def2/J RIJCOSX
keywords: DEFGRID2
keywords: scfconv7
keywords: smallprint printgap noloewdin
keywords: NOSOSCF
formula: C14H16ClO5PS
InChI: InChI=1/C14H16ClO5PS/c1-4-17-21(22,18-5-2)20-10-6-7-11-9(3)13(15)14(16)19-12(11)8-10/h6-8H,4-5H2,1-3H3
38 atoms
Cl 6.069796 0.063412 0.184485
S  -3.098151 2.254713 0.433385
P  -3.239817 0.360996 0.19793
O  -1.898694 -0.394216 -0.34985
O  2.608111 -0.770064 -1.440146
O  -3.627789 -0.41514 1.523372
O  -4.28574 -0.162937 -0.876287
O  4.671588 -1.067951 -2.108169
C  2.08105 0.18141 0.686326
C  1.690279 -0.373942 -0.530464
C  3.492432 0.354107 0.958518
C  -0.61163 -0.17446 0.037123
C  0.360962 -0.545587 -0.874224
C  1.069475 0.538122 1.582873
C  -0.262816 0.357933 1.278563
C  4.362839 -0.067203 0.013881
C  3.904839 0.981366 2.244515
C  3.94028 -0.667441 -1.243453
C  -3.414323 -1.822207 1.786516
C  -4.643972 0.595762 -2.051283
C  -4.251355 -2.738852 0.929003
C  -3.551322 0.614348 -3.090761
H  0.090873 -0.966474 -1.834721
H  1.324263 0.9603 2.544997
H  -1.010711 0.631248 2.009749
H  3.472467 1.97926 2.335083
H  4.982258 1.073511 2.340461
H  3.541311 0.394279 3.089506
H  -3.679787 -1.935683 2.835883
H  -2.351741 -2.053044 1.69086
H  -4.920364 1.608865 -1.752987
H  -5.536914 0.103697 -2.432553
H  -3.936391 -2.744131 -0.113949
H  -4.139069 -3.75591 1.307166
H  -5.309759 -2.482663 0.977853
H  -3.244096 -0.392898 -3.372294
H  -2.673533 1.169618 -2.757831
H  -3.929436 1.110567 -3.985418
elementType: Cl S P O C H
totalener: -2119.25275367 hartree
nucrepener: 2306.91667671 hartree
electener: -4426.16943038 hartree
oneelecener: -7500.78441566 hartree
twoeener: 3074.61498528 hartree
cpcmener: -0.03132940 hartree
kineticenergy: 2113.25204548 hartree
xcener: -143.913049622143 hartree
chargesum: -0.0000000
charge: -0.067331 -0.423091 0.715462 -0.315122 -0.224465 -0.345628 -0.328025 -0.407853 -0.050946 0.223466 0.027125 0.297644 -0.220571 -0.117214 -0.161938 0.006801 -0.232213 0.341066 0.028896 0.023662 -0.242280 -0.235062 0.145315 0.158267 0.124352 0.117714 0.088763 0.116248 0.111065 0.098016 0.096603 0.107659 0.082467 0.100264 0.092117 0.090676 0.078721 0.099369
qa: -0.0673 -0.4231 0.7155 -0.3151 -0.2245 -0.3456 -0.3280 -0.4079 -0.0509 0.2235 0.0271 0.2976 -0.2206 -0.1172 -0.1619 0.0068 -0.2322 0.3411 0.0289 0.0237 -0.2423 -0.2351 0.1453 0.1583 0.1244 0.1177 0.0888 0.1162 0.1111 0.0980 0.0966 0.1077 0.0825 0.1003 0.0921 0.0907 0.0787 0.0994
va: 1.2656 2.0221 5.4975 2.0828 2.2076 2.1130 2.1107 2.1105 3.7674 3.9573 3.6937 3.7746 4.0436 3.9366 3.9747 3.6690 3.9461 4.4088 3.8754 3.8637 3.9199 3.8877 1.0145 0.9935 1.0374 0.9950 1.0258 0.9952 0.9865 0.9927 1.0097 0.9915 1.0145 1.0078 1.0059 1.0054 1.0178 1.0098
dispcorr: -0.019132906 hartree
energy: -2119.271886579511
dipole: -30.74334 28.62936 -2.11398 -5.56342 4.85854 -0.70488 2.28212 -0.51754 1.76459
magnitude: 2.84245 au
magnitude: 7.22495 debye
