program: Orca
programVersion: 5.0.2
elementType: Cl S P O O O O O C C C C C C C C C C C C C C H H H H H H H H H H H H H H H H
charge: 0
multiplicity: 1
keywords: wb97x-d3
keywords: def2-TZVPP
keywords: def2/J RIJCOSX
keywords: DEFGRID2
keywords: scfconv7
keywords: smallprint printgap noloewdin
keywords: NOSOSCF
formula: C14H16ClO5PS
InChI: InChI=1/C14H16ClO5PS/c1-4-17-21(22,18-5-2)20-10-6-7-11-9(3)13(15)14(16)19-12(11)8-10/h6-8H,4-5H2,1-3H3
38 atoms
Cl 5.764225 0.960835 -0.368233
S  -3.42008 1.354644 0.901548
P  -3.115572 -0.301951 -0.017329
O  -1.895414 -1.213917 0.558619
O  2.349512 -0.660401 -1.377764
O  -4.272821 -1.387526 -0.00095
O  -2.767061 -0.232076 -1.565344
O  4.268854 -0.48315 -2.412869
C  1.991092 0.222599 0.812791
C  1.535588 -0.447481 -0.319978
C  3.35904 0.698731 0.842284
C  -0.61794 -0.72317 0.634287
C  0.239433 -0.924312 -0.428975
C  1.091506 0.396357 1.871074
C  -0.203529 -0.066602 1.789559
C  4.123097 0.459987 -0.246601
C  3.842182 1.415921 2.054276
C  3.632065 -0.244685 -1.422636
C  -5.187621 -1.544912 1.104378
C  -2.813895 0.978722 -2.35177
C  -4.545925 -2.186348 2.309337
C  -1.481588 1.68345 -2.356077
H  -0.080626 -1.447817 -1.320615
H  1.407715 0.903893 2.771591
H  -0.889235 0.068746 2.614605
H  3.232494 2.301829 2.238933
H  4.87714 1.732666 1.970893
H  3.755439 0.775562 2.93379
H  -5.985953 -2.171092 0.710036
H  -5.616931 -0.573222 1.356851
H  -3.604425 1.633262 -1.98198
H  -3.091079 0.65428 -3.353577
H  -5.318445 -2.37425 3.056099
H  -4.083893 -3.14195 2.060774
H  -3.796357 -1.543146 2.771789
H  -1.197856 2.017498 -1.357729
H  -1.55073 2.565677 -2.99432
H  -0.689165 1.048104 -2.752389
elementType: Cl S P O C H
totalener: -2119.25416922 hartree
nucrepener: 2336.77624676 hartree
electener: -4456.03041599 hartree
oneelecener: -7560.87426454 hartree
twoeener: 3104.84384855 hartree
cpcmener: -0.02887609 hartree
kineticenergy: 2113.27565608 hartree
xcener: -143.915461861725 hartree
chargesum: -0.0000000
charge: -0.065942 -0.442746 0.750496 -0.347564 -0.226633 -0.343637 -0.351848 -0.407672 -0.045675 0.276037 0.033215 0.330475 -0.280712 -0.105686 -0.207607 0.004544 -0.231670 0.338878 0.029234 0.051486 -0.234670 -0.249593 0.147309 0.158937 0.145646 0.116672 0.089744 0.116710 0.109995 0.093816 0.092351 0.108721 0.099022 0.091202 0.078069 0.079108 0.108443 0.091546
qa: -0.0659 -0.4427 0.7505 -0.3476 -0.2266 -0.3436 -0.3518 -0.4077 -0.0457 0.2760 0.0332 0.3305 -0.2807 -0.1057 -0.2076 0.0045 -0.2317 0.3389 0.0292 0.0515 -0.2347 -0.2496 0.1473 0.1589 0.1456 0.1167 0.0897 0.1167 0.1100 0.0938 0.0924 0.1087 0.0990 0.0912 0.0781 0.0791 0.1084 0.0915
va: 1.2671 1.9816 5.5067 2.0901 2.2015 2.1273 2.1115 2.1112 3.7797 3.8638 3.6855 3.6904 4.0548 3.8853 4.0674 3.6774 3.9438 4.4139 3.8640 3.8303 3.8931 3.9043 1.0214 0.9924 1.0073 0.9951 1.0253 0.9950 0.9915 1.0101 1.0136 0.9944 1.0088 1.0067 1.0137 1.0157 1.0096 1.0013
dispcorr: -0.019740811 hartree
energy: -2119.273910033724
dipole: -26.04839 24.23836 -1.81002 1.05352 -0.60806 0.44546 8.63729 -6.45796 2.17933
magnitude: 2.86777 au
magnitude: 7.28928 debye
