program: Orca
programVersion: 5.0.2
elementType: Cl S P O O O O O C C C C C C C C C C C C C C H H H H H H H H H H H H H H H H
charge: 0
multiplicity: 1
keywords: wb97x-d3
keywords: def2-TZVPP
keywords: def2/J RIJCOSX
keywords: DEFGRID2
keywords: scfconv7
keywords: smallprint printgap noloewdin
keywords: NOSOSCF
formula: C14H16ClO5PS
InChI: InChI=1/C14H16ClO5PS/c1-4-17-21(22,18-5-2)20-10-6-7-11-9(3)13(15)14(16)19-12(11)8-10/h6-8H,4-5H2,1-3H3
38 atoms
Cl 5.960557 -0.021156 0.304341
S  -2.423774 1.736201 1.402671
P  -3.037509 0.293164 0.30778
O  -1.972249 -0.242115 -0.810693
O  2.411878 1.41335 -0.500471
O  -3.43414 -0.997864 1.139298
O  -4.301723 0.53064 -0.622678
O  4.395349 2.331824 -0.409112
C  2.051882 -0.904416 -0.041529
C  1.575031 0.358008 -0.388145
C  3.471445 -1.075794 0.19159
C  -0.650465 -0.449785 -0.525567
C  0.234504 0.60423 -0.632441
C  1.120788 -1.944923 0.05604
C  -0.219934 -1.726388 -0.176097
C  4.257808 0.016128 0.063885
C  3.980698 -2.426837 0.553495
C  3.741463 1.331383 -0.289037
C  -4.061676 -2.159725 0.544922
C  -4.555741 1.76816 -1.320689
C  -3.81448 -3.340365 1.445554
C  -3.644446 1.979189 -2.504813
H  -0.101149 1.595395 -0.9073
H  1.447707 -2.940734 0.320648
H  -0.928541 -2.540924 -0.103677
H  3.749295 -3.143158 -0.236522
H  3.496309 -2.783035 1.464091
H  5.053581 -2.441695 0.716951
H  -3.657091 -2.345241 -0.452119
H  -5.129827 -1.960968 0.446589
H  -4.483711 2.597899 -0.614568
H  -5.592903 1.690852 -1.642399
H  -4.218526 -3.175336 2.444661
H  -4.310338 -4.216305 1.026352
H  -2.751247 -3.566107 1.531796
H  -3.989026 2.856385 -3.054046
H  -3.66532 1.1304 -3.188457
H  -2.612338 2.167672 -2.209553
elementType: Cl S P O C H
totalener: -2119.25504248 hartree
nucrepener: 2312.16017414 hartree
electener: -4431.41521662 hartree
oneelecener: -7511.61968975 hartree
twoeener: 3080.20447312 hartree
cpcmener: -0.03398041 hartree
kineticenergy: 2113.26659954 hartree
xcener: -143.911115309991 hartree
chargesum: -0.0000000
charge: -0.066019 -0.419909 0.714698 -0.355648 -0.223419 -0.342051 -0.326342 -0.408056 -0.044613 0.221766 0.035352 0.305780 -0.196871 -0.108665 -0.200748 0.003013 -0.230431 0.342705 0.002697 0.028044 -0.237810 -0.231806 0.135317 0.156958 0.160423 0.116880 0.115968 0.089600 0.114149 0.114845 0.092324 0.107878 0.092800 0.090355 0.081967 0.099853 0.090532 0.078488
qa: -0.0660 -0.4199 0.7147 -0.3556 -0.2234 -0.3421 -0.3263 -0.4081 -0.0446 0.2218 0.0354 0.3058 -0.1969 -0.1087 -0.2007 0.0030 -0.2304 0.3427 0.0027 0.0280 -0.2378 -0.2318 0.1353 0.1570 0.1604 0.1169 0.1160 0.0896 0.1141 0.1148 0.0923 0.1079 0.0928 0.0904 0.0820 0.0999 0.0905 0.0785
va: 1.2671 2.0282 5.5283 2.0542 2.2123 2.1224 2.1046 2.1104 3.7672 3.9791 3.6815 3.7575 4.0511 3.9036 4.0961 3.6778 3.9432 4.4078 3.8492 3.8634 3.9513 3.8971 1.0222 0.9946 0.9926 0.9950 0.9950 1.0255 0.9894 0.9971 1.0093 0.9897 1.0036 1.0063 1.0065 1.0098 1.0065 1.0083
dispcorr: -0.019085072 hartree
energy: -2119.274127549327
dipole: -31.49045 28.96274 -2.52771 -16.24441 12.44912 -3.79529 -5.10887 4.00357 -1.10530
magnitude: 4.69204 au
magnitude: 11.92622 debye
