program: Orca
programVersion: 5.0.2
elementType: Cl S P O O O O O C C C C C C C C C C C C C C H H H H H H H H H H H H H H H H
charge: 0
multiplicity: 1
keywords: wb97x-d3
keywords: def2-TZVPP
keywords: def2/J RIJCOSX
keywords: DEFGRID2
keywords: scfconv7
keywords: smallprint printgap noloewdin
keywords: NOSOSCF
formula: C14H16ClO5PS
InChI: InChI=1/C14H16ClO5PS/c1-4-17-21(22,18-5-2)20-10-6-7-11-9(3)13(15)14(16)19-12(11)8-10/h6-8H,4-5H2,1-3H3
38 atoms
Cl 5.966841 -0.377043 0.668042
S  -2.973434 1.433273 1.618775
P  -3.018016 0.218013 0.140261
O  -1.83444 0.433124 -0.96478
O  2.349164 -1.564422 -0.228104
O  -2.91848 -1.296647 0.586985
O  -4.269259 0.231749 -0.833533
O  4.24066 -2.635507 0.023492
C  2.178154 0.806846 0.021689
C  1.607904 -0.434673 -0.250003
C  3.591804 0.874197 0.329935
C  -0.520172 0.551902 -0.603904
C  0.265169 -0.582202 -0.555573
C  1.344289 1.930337 -0.030626
C  0.006389 1.812665 -0.337194
C  4.282893 -0.287696 0.330724
C  4.199511 2.201697 0.621917
C  3.671695 -1.577505 0.040187
C  -3.060021 -2.41947 -0.315362
C  -4.813222 1.458443 -1.370807
C  -2.401105 -3.615345 0.320696
C  -6.104715 1.80899 -0.678003
H  -0.142894 -1.561496 -0.772409
H  1.74876 2.912156 0.172197
H  -0.628203 2.686909 -0.382794
H  3.703984 2.666298 1.47594
H  4.072278 2.872625 -0.229164
H  5.260236 2.138481 0.843581
H  -2.602777 -2.194015 -1.280794
H  -4.123926 -2.599016 -0.47641
H  -4.970555 1.272384 -2.432821
H  -4.09041 2.272762 -1.282973
H  -2.848202 -3.851744 1.286656
H  -2.532679 -4.481828 -0.327716
H  -1.330841 -3.460689 0.4605
H  -6.539102 2.688377 -1.154849
H  -5.943258 2.041596 0.374598
H  -6.829474 0.997469 -0.750524
elementType: Cl S P O C H
totalener: -2119.25547826 hartree
nucrepener: 2303.99604236 hartree
electener: -4423.25152063 hartree
oneelecener: -7495.17035273 hartree
twoeener: 3071.91883211 hartree
cpcmener: -0.03298324 hartree
kineticenergy: 2113.27029963 hartree
xcener: -143.910795630437 hartree
chargesum: -0.0000000
charge: -0.065758 -0.427702 0.720862 -0.351100 -0.224988 -0.337230 -0.330015 -0.408606 -0.046621 0.211656 0.039950 0.281972 -0.181676 -0.107283 -0.194529 0.001203 -0.230075 0.341379 -0.001090 0.039340 -0.237011 -0.230893 0.158837 0.157907 0.144162 0.116764 0.116291 0.089550 0.115888 0.117472 0.106341 0.089952 0.092687 0.091034 0.083165 0.093125 0.076070 0.088969
qa: -0.0658 -0.4277 0.7209 -0.3511 -0.2250 -0.3372 -0.3300 -0.4086 -0.0466 0.2117 0.0400 0.2820 -0.1817 -0.1073 -0.1945 0.0012 -0.2301 0.3414 -0.0011 0.0393 -0.2370 -0.2309 0.1588 0.1579 0.1442 0.1168 0.1163 0.0896 0.1159 0.1175 0.1063 0.0900 0.0927 0.0910 0.0832 0.0931 0.0761 0.0890
va: 1.2677 2.0144 5.5279 2.0647 2.2097 2.1288 2.0927 2.1103 3.7618 3.9886 3.6762 3.7970 4.0477 3.8905 4.0558 3.6784 3.9428 4.4092 3.8485 3.8634 3.9489 3.9316 1.0027 0.9928 1.0095 0.9951 0.9953 1.0252 0.9885 0.9971 0.9953 1.0010 1.0039 1.0062 1.0070 1.0085 1.0177 1.0043
dispcorr: -0.018751892 hartree
energy: -2119.274230156377
dipole: -31.58194 29.76043 -1.82151 4.43840 -2.47629 1.96211 -6.10339 4.39590 -1.70749
magnitude: 3.17542 au
magnitude: 8.07129 debye
