program: Orca
programVersion: 5.0.2
elementType: Cl S P O O O O O C C C C C C C C C C C C C C H H H H H H H H H H H H H H H H
charge: 0
multiplicity: 1
keywords: wb97x-d3
keywords: def2-TZVPP
keywords: def2/J RIJCOSX
keywords: DEFGRID2
keywords: scfconv7
keywords: smallprint printgap noloewdin
keywords: NOSOSCF
formula: C14H16ClO5PS
InChI: InChI=1/C14H16ClO5PS/c1-4-17-21(22,18-5-2)20-10-6-7-11-9(3)13(15)14(16)19-12(11)8-10/h6-8H,4-5H2,1-3H3
38 atoms
Cl 5.942454 0.086445 -0.949326
S  -4.556631 -0.236748 1.638092
P  -2.942456 -0.212111 0.610229
O  -1.691958 0.29067 1.51458
O  2.597027 -1.352136 0.480179
O  -2.38243 -1.587948 0.04824
O  -2.902116 0.700118 -0.69555
O  4.542667 -2.262409 0.060654
C  2.145601 0.955486 0.058267
C  1.742955 -0.304429 0.495361
C  3.502251 1.130459 -0.42016
C  -0.434362 0.494408 0.999766
C  0.462912 -0.554387 0.964588
C  1.206779 1.991856 0.116359
C  -0.072439 1.770858 0.578948
C  4.307036 0.044396 -0.418546
C  3.930997 2.478539 -0.882541
C  3.870963 -1.266651 0.043128
C  -3.240951 -2.651491 -0.413614
C  -3.540106 1.993611 -0.760524
C  -3.909225 -2.335075 -1.727831
C  -4.833139 1.90707 -1.530439
H  0.190456 -1.542839 1.309584
H  1.478916 2.986888 -0.206494
H  -0.783653 2.584165 0.630774
H  3.83673 3.203672 -0.072569
H  3.293994 2.821499 -1.699055
H  4.959174 2.495546 -1.229129
H  -3.977089 -2.876954 0.360706
H  -2.581055 -3.512115 -0.51007
H  -2.827259 2.647694 -1.261539
H  -3.708632 2.391338 0.242211
H  -4.444098 -3.222833 -2.068686
H  -4.638655 -1.529187 -1.63996
H  -3.182124 -2.06868 -2.49487
H  -5.259905 2.906046 -1.627886
H  -5.562839 1.280256 -1.019056
H  -4.673762 1.51346 -2.534446
elementType: Cl S P O C H
totalener: -2119.25434329 hartree
nucrepener: 2310.63491133 hartree
electener: -4429.88925462 hartree
oneelecener: -7508.31347943 hartree
twoeener: 3078.42422481 hartree
cpcmener: -0.03222880 hartree
kineticenergy: 2113.26406970 hartree
xcener: -143.911607736341 hartree
chargesum: -0.0000000
charge: -0.065345 -0.425664 0.715043 -0.347463 -0.224158 -0.327671 -0.334830 -0.407127 -0.039360 0.224937 0.033284 0.271242 -0.197841 -0.105285 -0.206010 0.003990 -0.229819 0.343665 0.026159 0.044750 -0.232033 -0.248564 0.143564 0.157071 0.158744 0.116779 0.116236 0.088868 0.093974 0.107976 0.106993 0.097224 0.099516 0.076685 0.091895 0.100604 0.080451 0.091518
qa: -0.0653 -0.4257 0.7150 -0.3475 -0.2242 -0.3277 -0.3348 -0.4071 -0.0394 0.2249 0.0333 0.2712 -0.1978 -0.1053 -0.2060 0.0040 -0.2298 0.3437 0.0262 0.0447 -0.2320 -0.2486 0.1436 0.1571 0.1587 0.1168 0.1162 0.0889 0.0940 0.1080 0.1070 0.0972 0.0995 0.0767 0.0919 0.1006 0.0805 0.0915
va: 1.2677 2.0149 5.5295 2.1334 2.2102 2.1150 2.0627 2.1112 3.7689 3.9298 3.6865 3.8075 4.0633 3.8770 4.0488 3.6776 3.9432 4.4066 3.8664 3.8250 3.8951 3.9456 1.0193 0.9944 0.9966 0.9952 0.9953 1.0257 1.0090 0.9909 0.9922 1.0037 1.0103 1.0114 1.0056 1.0100 1.0150 1.0020
dispcorr: -0.019129683 hartree
energy: -2119.273472976032
dipole: -31.71118 30.33176 -1.37942 9.48716 -6.62554 2.86162 -12.67224 10.98430 -1.68794
magnitude: 3.59734 au
magnitude: 9.14371 debye
