program: Orca
programVersion: 5.0.2
elementType: Cl S P O O O O O C C C C C C C C C C C C C C H H H H H H H H H H H H H H H H
charge: 0
multiplicity: 1
keywords: wb97x-d3
keywords: def2-TZVPP
keywords: def2/J RIJCOSX
keywords: DEFGRID2
keywords: scfconv7
keywords: smallprint printgap noloewdin
keywords: NOSOSCF
formula: C14H16ClO5PS
InChI: InChI=1/C14H16ClO5PS/c1-4-17-21(22,18-5-2)20-10-6-7-11-9(3)13(15)14(16)19-12(11)8-10/h6-8H,4-5H2,1-3H3
38 atoms
Cl 5.857033 0.927941 0.003359
S  -2.841997 0.838637 1.515796
P  -3.009451 -0.261698 -0.037457
O  -1.83577 -1.355906 -0.278422
O  2.004791 1.398632 -0.537213
O  -4.290957 -1.200455 -0.12527
O  -3.010891 0.450044 -1.461409
O  3.716278 2.763469 -0.727533
C  2.272545 -0.886992 0.099744
C  1.472339 0.190013 -0.274861
C  3.703253 -0.6898 0.206195
C  -0.498981 -1.138099 -0.151635
C  0.096326 0.082543 -0.408133
C  1.633571 -2.106883 0.345295
C  0.269044 -2.237556 0.22851
C  4.188221 0.538719 -0.071253
C  4.559438 -1.844529 0.608816
C  3.33616 1.664595 -0.467516
C  -4.981557 -1.675392 1.037401
C  -3.77814 1.646108 -1.680458
C  -4.231146 -2.780015 1.745564
C  -2.88823 2.866171 -1.656625
H  -0.468335 0.950313 -0.717777
H  2.21522 -2.969697 0.637976
H  -0.215092 -3.184072 0.424457
H  4.462578 -2.659921 -0.109744
H  4.250803 -2.228578 1.582151
H  5.608913 -1.576491 0.67192
H  -5.940078 -2.032195 0.663284
H  -5.170165 -0.840347 1.715805
H  -4.572121 1.73896 -0.935128
H  -4.252642 1.518117 -2.652997
H  -3.307081 -2.412859 2.191992
H  -4.849383 -3.177513 2.550697
H  -3.992712 -3.598533 1.067567
H  -2.090275 2.790354 -2.39475
H  -2.445497 3.008765 -0.671644
H  -3.476286 3.753678 -1.891164
totalener: -2119.23144170 hartree
nucrepener: 2318.66633012 hartree
electener: -4437.89777182 hartree
oneelecener: -7524.59641397 hartree
twoeener: 3086.69864215 hartree
kineticenergy: 2113.33187218 hartree
xcener: -143.922810938806 hartree
chargesum: 0.0000000
charge: -0.042186 -0.371613 0.681978 -0.301325 -0.208002 -0.319143 -0.318788 -0.290974 -0.060444 0.148158 0.019345 0.262036 -0.094787 -0.092688 -0.174198 0.000085 -0.254024 0.284386 0.017704 0.026166 -0.231633 -0.246271 0.107902 0.131124 0.121915 0.103124 0.101939 0.094174 0.096899 0.093267 0.083321 0.097675 0.082865 0.087353 0.089274 0.090771 0.090983 0.093632
qa: -0.0422 -0.3716 0.6820 -0.3013 -0.2080 -0.3191 -0.3188 -0.2910 -0.0604 0.1482 0.0193 0.2620 -0.0948 -0.0927 -0.1742 0.0001 -0.2540 0.2844 0.0177 0.0262 -0.2316 -0.2463 0.1079 0.1311 0.1219 0.1031 0.1019 0.0942 0.0969 0.0933 0.0833 0.0977 0.0829 0.0874 0.0893 0.0908 0.0910 0.0936
va: 1.2926 2.0448 5.5434 2.1711 2.2351 2.1360 2.1100 2.2237 3.7915 4.1706 3.6059 3.8945 3.9586 3.9186 4.0527 3.7323 3.9537 4.4216 3.8856 3.8958 3.8906 3.8984 1.0373 1.0008 1.0142 0.9961 0.9963 1.0361 0.9920 1.0136 1.0070 0.9954 1.0194 1.0118 1.0062 1.0025 1.0175 1.0136
dispcorr: -0.018727075 hartree
energy: -2119.250168772585
dipole: -28.10015 26.66131 -1.43884 -11.14579 9.09123 -2.05457 2.13897 -1.99800 0.14097
magnitude: 2.51225 au
magnitude: 6.38562 debye
