program: Orca
programVersion: 5.0.2
elementType: Cl S P O O O O O C C C C C C C C C C C C C C H H H H H H H H H H H H H H H H
charge: 0
multiplicity: 1
keywords: wb97x-d3
keywords: def2-TZVPP
keywords: def2/J RIJCOSX
keywords: DEFGRID2
keywords: scfconv7
keywords: smallprint printgap noloewdin
keywords: NOSOSCF
formula: C14H16ClO5PS
InChI: InChI=1/C14H16ClO5PS/c1-4-17-21(22,18-5-2)20-10-6-7-11-9(3)13(15)14(16)19-12(11)8-10/h6-8H,4-5H2,1-3H3
38 atoms
Cl 5.783491 0.926007 -0.344408
S  -3.389804 1.311204 0.910946
P  -3.103214 -0.341058 -0.013557
O  -1.878025 -1.259532 0.534904
O  2.344695 -0.615257 -1.419644
O  -4.267102 -1.41983 0.024949
O  -2.765938 -0.264555 -1.565838
O  4.27323 -0.402952 -2.45085
C  2.003936 0.186817 0.805774
C  1.543783 -0.441578 -0.350434
C  3.377962 0.645868 0.849551
C  -0.608528 -0.757076 0.611714
C  0.24576 -0.915934 -0.46138
C  1.105058 0.332411 1.867722
C  -0.190833 -0.125735 1.779245
C  4.140873 0.443241 -0.244611
C  3.875834 1.308044 2.091079
C  3.641339 -0.20952 -1.459678
C  -5.188864 -1.515467 1.118103
C  -2.89225 0.935033 -2.344957
C  -4.558666 -2.097162 2.363509
C  -1.590806 1.700812 -2.381802
H  -0.080834 -1.409575 -1.366528
H  1.424542 0.817961 2.779058
H  -0.881034 -0.002266 2.601427
H  3.283557 2.196457 2.315779
H  4.914507 1.610458 2.007591
H  3.7888 0.633134 2.943994
H  -5.988348 -2.157163 0.750061
H  -5.611992 -0.529103 1.323304
H  -3.694821 1.559744 -1.948065
H  -3.184017 0.601253 -3.340189
H  -4.086412 -3.057812 2.161533
H  -3.812922 -1.424708 2.787541
H  -5.329505 -2.250327 3.119022
H  -1.315976 2.055797 -1.389018
H  -1.699646 2.570744 -3.030235
H  -0.777128 1.09088 -2.773481
totalener: -2119.23150180 hartree
nucrepener: 2337.06703488 hartree
electener: -4456.29853668 hartree
oneelecener: -7561.29499350 hartree
twoeener: 3104.99645682 hartree
kineticenergy: 2113.33769312 hartree
xcener: -143.922729612758 hartree
chargesum: 0.0000000
charge: -0.039803 -0.397015 0.707314 -0.329965 -0.212161 -0.310673 -0.328556 -0.288548 -0.041494 0.244177 0.014751 0.298286 -0.264774 -0.104341 -0.160427 0.004250 -0.253338 0.281348 0.012728 0.032517 -0.224030 -0.240710 0.142217 0.133388 0.120218 0.103332 0.094049 0.103709 0.097836 0.092503 0.088059 0.099042 0.092372 0.076611 0.086062 0.087076 0.095716 0.088275
qa: -0.0398 -0.3970 0.7073 -0.3300 -0.2122 -0.3107 -0.3286 -0.2885 -0.0415 0.2442 0.0148 0.2983 -0.2648 -0.1043 -0.1604 0.0043 -0.2533 0.2813 0.0127 0.0325 -0.2240 -0.2407 0.1422 0.1334 0.1202 0.1033 0.0940 0.1037 0.0978 0.0925 0.0881 0.0990 0.0924 0.0766 0.0861 0.0871 0.0957 0.0883
va: 1.2951 2.0235 5.5344 2.1098 2.2222 2.1486 2.1260 2.2249 3.7870 3.9325 3.6237 3.7961 4.0385 3.9326 4.1214 3.7367 3.9534 4.4249 3.8971 3.8638 3.8888 3.9012 1.0219 1.0003 1.0148 0.9960 1.0359 0.9962 0.9918 1.0113 1.0146 0.9933 1.0072 1.0178 1.0116 1.0173 1.0135 1.0025
dispcorr: -0.019620233 hartree
energy: -2119.251122033897
dipole: -26.52468 25.18234 -1.34234 1.23042 -1.00266 0.22776 8.81640 -7.37693 1.43946
magnitude: 1.98136 au
magnitude: 5.03623 debye
