program: Orca
programVersion: 5.0.2
elementType: Cl S P O O O O O C C C C C C C C C C C C C C H H H H H H H H H H H H H H H H
charge: 0
multiplicity: 1
keywords: wb97x-d3
keywords: def2-TZVPP
keywords: def2/J RIJCOSX
keywords: DEFGRID2
keywords: scfconv7
keywords: smallprint printgap noloewdin
keywords: NOSOSCF
formula: C14H16ClO5PS
InChI: InChI=1/C14H16ClO5PS/c1-4-17-21(22,18-5-2)20-10-6-7-11-9(3)13(15)14(16)19-12(11)8-10/h6-8H,4-5H2,1-3H3
38 atoms
Cl 6.00669 -0.047422 0.34732
S  -2.740949 -0.338637 1.863584
P  -2.944232 -0.218087 -0.032233
O  -1.900872 0.743561 -0.821854
O  2.255179 -1.179126 0.399375
O  -2.778849 -1.557132 -0.875911
O  -4.310523 0.377167 -0.58671
O  4.120293 -2.158982 1.02562
C  2.228731 1.033055 -0.497106
C  1.573647 -0.128871 -0.096067
C  3.669942 1.100886 -0.373825
C  -0.549737 0.777967 -0.678379
C  0.196618 -0.274785 -0.182333
C  1.439979 2.073134 -1.000223
C  0.072467 1.957171 -1.088385
C  4.305891 0.025577 0.136165
C  4.371511 2.344189 -0.810277
C  3.605259 -1.189839 0.562128
C  -3.162176 -2.836361 -0.35213
C  -5.081271 1.340046 0.143764
C  -4.660852 -2.996922 -0.236853
C  -4.46555 2.720978 0.113219
H  -0.249945 -1.20266 0.145039
H  1.905867 2.993076 -1.324712
H  -0.52791 2.76835 -1.476254
H  4.008263 3.205438 -0.247499
H  4.180636 2.540065 -1.86655
H  5.445569 2.281395 -0.669853
H  -2.683401 -2.989215 0.618219
H  -2.744714 -3.557488 -1.053065
H  -5.211597 0.997505 1.173087
H  -6.057044 1.33776 -0.339821
H  -5.158904 -2.790202 -1.183155
H  -4.890673 -4.023215 0.049735
H  -5.077859 -2.342864 0.528669
H  -5.148023 3.430177 0.581764
H  -4.282509 3.053362 -0.907903
H  -3.526932 2.755186 0.66612
totalener: -2119.23150945 hartree
nucrepener: 2311.61177196 hartree
electener: -4430.84328141 hartree
oneelecener: -7510.45307169 hartree
twoeener: 3079.60979028 hartree
kineticenergy: 2113.33061575 hartree
xcener: -143.923404456100 hartree
chargesum: 0.0000000
charge: -0.042451 -0.366499 0.673818 -0.299955 -0.208018 -0.320823 -0.316197 -0.290748 -0.064010 0.143929 0.022269 0.289110 -0.106915 -0.093249 -0.183724 -0.000218 -0.253394 0.282507 0.015797 0.021681 -0.229849 -0.232984 0.101824 0.131760 0.122507 0.102481 0.102301 0.093777 0.093590 0.100998 0.092062 0.097521 0.093133 0.087380 0.079851 0.087856 0.088796 0.084086
qa: -0.0425 -0.3665 0.6738 -0.3000 -0.2080 -0.3208 -0.3162 -0.2907 -0.0640 0.1439 0.0223 0.2891 -0.1069 -0.0932 -0.1837 -0.0002 -0.2534 0.2825 0.0158 0.0217 -0.2298 -0.2330 0.1018 0.1318 0.1225 0.1025 0.1023 0.0938 0.0936 0.1010 0.0921 0.0975 0.0931 0.0874 0.0799 0.0879 0.0888 0.0841
va: 1.2923 2.0550 5.5512 2.1839 2.2338 2.1104 2.1272 2.2237 3.7958 4.1702 3.6076 3.8649 3.9694 3.9208 4.0551 3.7342 3.9531 4.4236 3.8849 3.8766 3.9078 3.9014 1.0506 1.0006 1.0150 0.9963 0.9962 1.0364 1.0095 0.9904 1.0130 0.9915 1.0063 1.0108 1.0194 1.0116 1.0063 1.0183
dispcorr: -0.018609610 hartree
energy: -2119.250119059782
dipole: -33.70844 32.00673 -1.70171 8.13704 -6.55343 1.58361 -5.46770 4.32306 -1.14464
magnitude: 2.59111 au
magnitude: 6.58608 debye
