program: Orca
programVersion: 5.0.3
elementType: Cl Cl Cl S P O O O N C C C C C C C C C H H H H H H H H H H H
charge: 0
multiplicity: 1
keywords: wb97x-d3
keywords: def2-TZVPP
keywords: def2/J RIJCOSX
keywords: DEFGRID2
keywords: scfconv7
keywords: smallprint printgap noloewdin
keywords: NOSOSCF
formula: C9H11Cl3NO3PS
InChI: InChI=1/C9H11Cl3NO3PS/c1-3-14-17(18,15-4-2)16-9-7(11)5-6(10)8(12)13-9/h5H,3-4H2,1-2H3
29 atoms
Cl -0.740462 -0.771167 -2.743103
Cl -4.385576 0.249286 1.082699
Cl -2.094212 1.684239 2.70884
S  3.629088 -0.251509 -1.798581
P  2.241588 -0.25562 -0.486919
O  1.40816 -1.57886 -0.225218
O  2.645232 0.186323 0.984984
O  1.013402 0.7369 -0.911022
N  -0.554297 1.088927 0.712074
C  2.015738 -2.889281 -0.151512
C  3.695875 1.138546 1.262174
C  -0.252003 0.570478 -0.451319
C  0.924067 -3.915545 -0.290383
C  3.305312 2.553511 0.918693
C  -1.187855 -0.094126 -1.236255
C  -2.482748 -0.194123 -0.766122
C  -2.793071 0.357438 0.466027
C  -1.7781 0.989925 1.1729
H  2.750246 -2.98922 -0.952566
H  2.533052 -2.982712 0.804082
H  3.884447 1.034661 2.328821
H  4.598564 0.837189 0.72787
H  1.368047 -4.910162 -0.251582
H  0.195136 -3.843173 0.516632
H  0.404679 -3.81598 -1.243627
H  4.109579 3.220381 1.230744
H  3.161393 2.694197 -0.153036
H  2.398717 2.860452 1.439371
H  -3.242202 -0.700921 -1.34623
elementType: Cl S P O N C H
totalener: -2750.37751516 hartree
nucrepener: 2165.31122564 hartree
electener: -4915.68874080 hartree
oneelecener: -8100.44800680 hartree
twoeener: 3184.75926601 hartree
cpcmener: -0.01972338 hartree
kineticenergy: 2744.36332107 hartree
xcener: -158.740241621827 hartree
chargesum: -0.0000000
charge: -0.045555 -0.039895 -0.043201 -0.417673 0.712058 -0.313078 -0.335551 -0.336391 -0.286142 0.020164 0.038051 0.358905 -0.242297 -0.240983 -0.043936 -0.018293 -0.046898 0.176081 0.096141 0.116487 0.112736 0.096266 0.095746 0.092264 0.081659 0.103295 0.082545 0.086822 0.140674
qa: -0.0456 -0.0399 -0.0432 -0.4177 0.7121 -0.3131 -0.3356 -0.3364 -0.2861 0.0202 0.0381 0.3589 -0.2423 -0.2410 -0.0439 -0.0183 -0.0469 0.1761 0.0961 0.1165 0.1127 0.0963 0.0957 0.0923 0.0817 0.1033 0.0825 0.0868 0.1407
va: 1.2632 1.2720 1.2763 2.0332 5.5129 2.1121 2.0931 2.1151 3.0609 3.8455 3.8443 4.0656 3.9488 3.8984 4.0357 3.9870 4.0467 4.1914 1.0025 0.9895 0.9912 1.0115 1.0086 1.0027 1.0089 1.0098 1.0150 1.0118 1.0066
dispcorr: -0.015630610 hartree
energy: -2750.393145765237
dipole: 27.78449 -28.26771 -0.48322 -9.44636 8.33158 -1.11478 2.20368 -1.52963 0.67404
magnitude: 1.38945 au
magnitude: 3.53170 debye
