program: Orca
programVersion: 5.0.3
elementType: Cl Cl Cl S P O O O N C C C C C C C C C H H H H H H H H H H H
charge: 0
multiplicity: 1
keywords: wb97x-d3
keywords: def2-TZVPP
keywords: def2/J RIJCOSX
keywords: DEFGRID2
keywords: scfconv7
keywords: smallprint printgap noloewdin
keywords: NOSOSCF
formula: C9H11Cl3NO3PS
InChI: InChI=1/C9H11Cl3NO3PS/c1-3-14-17(18,15-4-2)16-9-7(11)5-6(10)8(12)13-9/h5H,3-4H2,1-2H3
29 atoms
Cl -1.291947 -0.462375 2.819664
Cl -4.573601 1.209656 -1.101597
Cl -2.00006 1.899969 -2.794884
S  0.803656 -2.444385 -0.067637
P  1.74576 -0.816931 0.274613
O  2.91167 -0.776937 1.344898
O  2.425369 -0.2005 -1.010997
O  0.778884 0.369115 0.888366
N  -0.652767 1.036522 -0.75799
C  2.776002 -1.320033 2.681253
C  3.197288 1.029937 -1.010226
C  -0.485508 0.529684 0.43924
C  3.248153 -2.750357 2.742778
C  3.190598 1.587046 -2.409353
C  -1.555482 0.192332 1.259536
C  -2.836012 0.405399 0.786713
C  -3.002251 0.936968 -0.481042
C  -1.863573 1.2363 -1.218537
H  3.390471 -0.676212 3.307989
H  1.744169 -1.22757 3.024828
H  2.765459 1.74514 -0.308777
H  4.210094 0.795172 -0.683034
H  4.277402 -2.847184 2.397278
H  3.20937 -3.087423 3.778764
H  2.615514 -3.410625 2.15104
H  2.182319 1.839647 -2.736504
H  3.785961 2.499691 -2.427583
H  3.626961 0.889332 -3.123948
H  -3.696025 0.156234 1.393207
elementType: Cl S P O N C H
totalener: -2750.37939336 hartree
nucrepener: 2153.73809236 hartree
electener: -4904.11748571 hartree
oneelecener: -8077.39782071 hartree
twoeener: 3173.28033499 hartree
cpcmener: -0.02065923 hartree
kineticenergy: 2744.34454611 hartree
xcener: -158.735575668140 hartree
chargesum: -0.0000000
charge: -0.043624 -0.040523 -0.044392 -0.413947 0.715227 -0.330283 -0.336673 -0.331867 -0.278688 0.041260 0.016623 0.346361 -0.239213 -0.232398 -0.036112 -0.019677 -0.041632 0.172345 0.109279 0.095758 0.117167 0.111978 0.091348 0.096294 0.076540 0.077379 0.091162 0.090114 0.140195
qa: -0.0436 -0.0405 -0.0444 -0.4139 0.7152 -0.3303 -0.3367 -0.3319 -0.2787 0.0413 0.0166 0.3464 -0.2392 -0.2324 -0.0361 -0.0197 -0.0416 0.1723 0.1093 0.0958 0.1172 0.1120 0.0913 0.0963 0.0765 0.0774 0.0912 0.0901 0.1402
va: 1.2623 1.2711 1.2744 2.0246 5.5306 2.1032 2.1266 2.0753 3.0464 3.8552 3.8407 4.0142 3.9221 3.9523 4.0683 3.9817 4.0507 4.1915 0.9953 1.0020 0.9918 0.9960 1.0041 1.0083 1.0205 1.0145 1.0066 1.0032 1.0062
dispcorr: -0.015719595 hartree
energy: -2750.395112952357
dipole: 36.20662 -35.61450 0.59213 -6.08754 7.22457 1.13703 7.30064 -5.55360 1.74704
magnitude: 2.16694 au
magnitude: 5.50792 debye
