program: Orca
programVersion: 5.0.3
elementType: Cl Cl Cl S P O O O N C C C C C C C C C H H H H H H H H H H H
charge: 0
multiplicity: 1
keywords: wb97x-d3
keywords: def2-TZVPP
keywords: def2/J RIJCOSX
keywords: DEFGRID2
keywords: scfconv7
keywords: smallprint printgap noloewdin
keywords: NOSOSCF
formula: C9H11Cl3NO3PS
InChI: InChI=1/C9H11Cl3NO3PS/c1-3-14-17(18,15-4-2)16-9-7(11)5-6(10)8(12)13-9/h5H,3-4H2,1-2H3
29 atoms
Cl -0.066201 2.687913 0.865749
Cl -4.609831 -0.190091 0.993007
Cl -3.364589 -2.028194 -1.246044
S  2.765466 -1.465707 -1.455756
P  2.04401 0.048159 -0.533849
O  1.658098 -0.14882 0.995943
O  2.881232 1.39611 -0.584589
O  0.672128 0.675302 -1.170482
N  -1.272995 -0.505019 -1.082031
C  1.687521 -1.414926 1.695117
C  4.324264 1.400149 -0.540709
C  -0.553472 0.489634 -0.625715
C  0.417321 -2.200929 1.497156
C  4.858622 1.041358 0.822699
C  -1.027541 1.3728 0.338933
C  -2.294831 1.169387 0.847538
C  -3.04004 0.101424 0.376398
C  -2.477229 -0.707443 -0.602961
H  2.5595 -1.986224 1.37452
H  1.825803 -1.147387 2.74065
H  4.70872 0.725432 -1.307801
H  4.602997 2.415202 -0.815646
H  0.295291 -2.52193 0.462895
H  0.462367 -3.097568 2.116555
H  -0.463011 -1.631254 1.79783
H  5.940402 1.175918 0.822136
H  4.441414 1.683866 1.597691
H  4.660368 0.001044 1.084455
H  -2.699163 1.830663 1.601749
elementType: Cl S P O N C H
totalener: -2750.37559225 hartree
nucrepener: 2185.35125329 hartree
electener: -4935.72684555 hartree
oneelecener: -8140.18510726 hartree
twoeener: 3204.45826171 hartree
cpcmener: -0.02268371 hartree
kineticenergy: 2744.35169451 hartree
xcener: -158.740628767742 hartree
chargesum: 0.0000000
charge: -0.040807 -0.039687 -0.045561 -0.420645 0.706757 -0.331526 -0.335157 -0.328823 -0.259764 0.045905 0.034511 0.273136 -0.234113 -0.237276 -0.013937 -0.029939 -0.032349 0.180853 0.099793 0.114901 0.094391 0.112614 0.077704 0.111215 0.084023 0.100487 0.091921 0.079778 0.141593
qa: -0.0408 -0.0397 -0.0456 -0.4206 0.7068 -0.3315 -0.3352 -0.3288 -0.2598 0.0459 0.0345 0.2731 -0.2341 -0.2373 -0.0139 -0.0299 -0.0323 0.1809 0.0998 0.1149 0.0944 0.1126 0.0777 0.1112 0.0840 0.1005 0.0919 0.0798 0.1416
va: 1.2735 1.2732 1.2718 2.0280 5.5186 2.0646 2.1071 2.1269 3.0451 3.8109 3.8499 4.1546 3.9167 3.8968 4.0150 4.0066 4.0340 4.1519 1.0112 0.9920 1.0129 0.9917 1.0199 1.0103 1.0020 1.0090 1.0066 1.0106 1.0077
dispcorr: -0.017294061 hartree
energy: -2750.392886311975
dipole: 33.94454 -33.54476 0.39978 -3.11253 3.95965 0.84712 10.62260 -8.21004 2.41257
magnitude: 2.58803 au
magnitude: 6.57826 debye
