program: Orca
programVersion: 5.0.3
elementType: Cl Cl Cl S P O O O N C C C C C C C C C H H H H H H H H H H H
charge: 0
multiplicity: 1
keywords: wb97x-d3
keywords: def2-TZVPP
keywords: def2/J RIJCOSX
keywords: DEFGRID2
keywords: scfconv7
keywords: smallprint printgap noloewdin
keywords: NOSOSCF
formula: C9H11Cl3NO3PS
InChI: InChI=1/C9H11Cl3NO3PS/c1-3-14-17(18,15-4-2)16-9-7(11)5-6(10)8(12)13-9/h5H,3-4H2,1-2H3
29 atoms
Cl 0.349325 2.70459 -0.285838
Cl -4.609856 0.718741 -0.932387
Cl -3.649502 -1.855214 0.612328
S  1.677512 -0.723761 -1.589245
P  2.054673 -0.356511 0.252631
O  2.64504 -1.541071 1.128468
O  3.025121 0.832347 0.638262
O  0.75026 0.114604 1.124712
N  -1.345337 -0.678453 0.773969
C  2.25412 -2.920936 0.93457
C  4.31249 0.98453 -0.00937
C  -0.480811 0.287755 0.587872
C  3.337437 -3.667685 0.20202
C  4.255149 2.079367 -1.043525
C  -0.810763 1.463319 -0.077153
C  -2.0987 1.606383 -0.555725
C  -3.005096 0.579304 -0.35479
C  -2.570886 -0.551361 0.325763
H  2.094263 -3.323931 1.933262
H  1.306981 -2.980168 0.396431
H  5.01194 1.228316 0.78846
H  4.634945 0.040236 -0.453211
H  3.490629 -3.26283 -0.798224
H  4.282695 -3.632887 0.743362
H  3.0468 -4.713425 0.100416
H  3.572571 1.829237 -1.85508
H  3.947485 3.027991 -0.603349
H  5.249581 2.215248 -1.469812
H  -2.395059 2.505377 -1.079106
elementType: Cl S P O N C H
totalener: -2750.37694447 hartree
nucrepener: 2154.68539525 hartree
electener: -4905.06233972 hartree
oneelecener: -8079.38976300 hartree
twoeener: 3174.32742329 hartree
cpcmener: -0.01859338 hartree
kineticenergy: 2744.35686744 hartree
xcener: -158.740253145506 hartree
chargesum: -0.0000000
charge: -0.040372 -0.040023 -0.043922 -0.427199 0.744668 -0.345468 -0.335964 -0.332177 -0.273466 0.056110 0.047984 0.322713 -0.238981 -0.243794 -0.028767 -0.024896 -0.042874 0.180773 0.109470 0.083809 0.108010 0.093266 0.075290 0.091785 0.096815 0.075093 0.089921 0.102041 0.140154
qa: -0.0404 -0.0400 -0.0439 -0.4272 0.7447 -0.3455 -0.3360 -0.3322 -0.2735 0.0561 0.0480 0.3227 -0.2390 -0.2438 -0.0288 -0.0249 -0.0429 0.1808 0.1095 0.0838 0.1080 0.0933 0.0753 0.0918 0.0968 0.0751 0.0899 0.1020 0.1402
va: 1.2737 1.2719 1.2750 1.9813 5.5060 2.1055 2.1080 2.1204 3.0479 3.8431 3.8637 4.0717 3.9336 3.9216 4.0611 3.9898 4.0430 4.1801 0.9963 1.0135 0.9959 1.0007 1.0170 1.0036 1.0084 1.0187 1.0027 1.0105 1.0075
dispcorr: -0.015552134 hartree
energy: -2750.392496603562
dipole: 40.67136 -39.61307 1.05829 -8.30787 8.71515 0.40728 -1.32424 1.25095 -0.07329
magnitude: 1.13632 au
magnitude: 2.88830 debye
