program: Orca
programVersion: 5.0.3
elementType: Cl Cl Cl S P O O O N C C C C C C C C C H H H H H H H H H H H
charge: 0
multiplicity: 1
keywords: wb97x-d3
keywords: def2-TZVPP
keywords: def2/J RIJCOSX
keywords: DEFGRID2
keywords: scfconv7
keywords: smallprint printgap noloewdin
keywords: NOSOSCF
formula: C9H11Cl3NO3PS
InChI: InChI=1/C9H11Cl3NO3PS/c1-3-14-17(18,15-4-2)16-9-7(11)5-6(10)8(12)13-9/h5H,3-4H2,1-2H3
29 atoms
Cl 0.357444 2.646448 -0.732861
Cl -4.662783 0.737844 -0.431915
Cl -3.485801 -1.782034 1.059665
S  1.472075 -0.87028 -2.035439
P  2.127252 -0.408125 -0.302026
O  2.853457 -1.526905 0.558012
O  3.177797 0.770662 -0.278571
O  0.959453 0.117652 0.737152
N  -1.175993 -0.64186 0.774896
C  2.552921 -2.937463 0.47101
C  3.805627 1.264424 0.93451
C  -0.336857 0.290506 0.39587
C  1.333394 -3.317853 1.270079
C  4.000531 2.750908 0.802049
C  -0.761991 1.436772 -0.269245
C  -2.110273 1.583165 -0.533276
C  -2.985172 0.589211 -0.128818
C  -2.456579 -0.514907 0.52798
H  2.441086 -3.215695 -0.578435
H  3.443073 -3.430148 0.856777
H  3.193213 1.038171 1.808148
H  4.758478 0.747618 1.045442
H  1.241189 -4.404115 1.266301
H  1.414004 -2.992582 2.30713
H  0.418417 -2.909272 0.844003
H  4.524103 3.117178 1.685099
H  4.60193 3.003619 -0.070967
H  3.04767 3.27527 0.73721
H  -2.479288 2.460882 -1.046728
elementType: Cl S P O N C H
totalener: -2750.37642588 hartree
nucrepener: 2167.34762511 hartree
electener: -4917.72405099 hartree
oneelecener: -8104.55588899 hartree
twoeener: 3186.83183801 hartree
cpcmener: -0.01937397 hartree
kineticenergy: 2744.34187303 hartree
xcener: -158.738769828096 hartree
chargesum: -0.0000000
charge: -0.044276 -0.040909 -0.046162 -0.411971 0.704744 -0.325331 -0.334624 -0.331511 -0.282320 0.035873 0.030396 0.346462 -0.238616 -0.239349 -0.025638 -0.028042 -0.039162 0.182603 0.091540 0.110278 0.108182 0.106945 0.100523 0.092708 0.071557 0.095804 0.091486 0.077945 0.140865
qa: -0.0443 -0.0409 -0.0462 -0.4120 0.7047 -0.3253 -0.3346 -0.3315 -0.2823 0.0359 0.0304 0.3465 -0.2386 -0.2393 -0.0256 -0.0280 -0.0392 0.1826 0.0915 0.1103 0.1082 0.1069 0.1005 0.0927 0.0716 0.0958 0.0915 0.0779 0.1409
va: 1.2709 1.2711 1.2730 2.0230 5.5102 2.1075 2.1101 2.0575 3.0608 3.8580 3.8464 4.0207 3.8973 3.9490 4.0659 3.9889 4.0514 4.1654 1.0099 0.9907 0.9917 0.9956 1.0110 1.0053 1.0230 1.0077 1.0032 1.0124 1.0064
dispcorr: -0.016123666 hartree
energy: -2750.392549544219
dipole: 33.63830 -32.94804 0.69026 -4.99367 5.65836 0.66468 8.80526 -7.49050 1.31475
magnitude: 1.62691 au
magnitude: 4.13528 debye
