program: Orca
programVersion: 5.0.3
elementType: Cl Cl Cl S P O O O N C C C C C C C C C H H H H H H H H H H H
charge: 0
multiplicity: 1
keywords: wb97x-d3
keywords: def2-TZVPP
keywords: def2/J RIJCOSX
keywords: DEFGRID2
keywords: scfconv7
keywords: smallprint printgap noloewdin
keywords: NOSOSCF
formula: C9H11Cl3NO3PS
InChI: InChI=1/C9H11Cl3NO3PS/c1-3-14-17(18,15-4-2)16-9-7(11)5-6(10)8(12)13-9/h5H,3-4H2,1-2H3
29 atoms
Cl -0.326291 3.081261 1.115174
Cl -4.868213 0.49045 -0.183995
Cl -3.088903 -2.037482 -0.829544
S  1.733043 -0.703606 -2.178646
P  1.907702 -0.533974 -0.284058
O  1.735087 -1.885355 0.510753
O  3.24772 0.0674 0.310328
O  0.862929 0.533666 0.414266
N  -1.07073 -0.56859 -0.137448
C  1.868084 -2.007157 1.950912
C  3.958941 1.164578 -0.307971
C  -0.468371 0.522109 0.26674
C  3.166062 -2.687383 2.300358
C  5.081521 0.650326 -1.172308
C  -1.165965 1.687992 0.577077
C  -2.53753 1.681676 0.443069
C  -3.165788 0.52673 0.000607
C  -2.376519 -0.57867 -0.278294
H  1.791586 -1.031331 2.432392
H  1.012573 -2.599502 2.27112
H  3.271119 1.79038 -0.879919
H  4.338855 1.763373 0.518322
H  3.204331 -2.842029 3.378879
H  3.248085 -3.662829 1.821279
H  4.02918 -2.085078 2.018365
H  5.658463 1.49485 -1.549534
H  5.757251 0.009544 -0.605528
H  4.703515 0.090858 -2.027437
H  -3.117353 2.564918 0.674283
elementType: Cl S P O N C H
totalener: -2750.37836883 hartree
nucrepener: 2133.66445994 hartree
electener: -4884.04282877 hartree
oneelecener: -8037.12497941 hartree
twoeener: 3153.08215064 hartree
cpcmener: -0.02294263 hartree
kineticenergy: 2744.36363473 hartree
xcener: -158.741497228003 hartree
chargesum: -0.0000000
charge: -0.047404 -0.046091 -0.043944 -0.418077 0.723482 -0.343734 -0.328494 -0.307097 -0.304127 0.045922 0.032048 0.448163 -0.248101 -0.234858 -0.076132 -0.016995 -0.052661 0.134465 0.103090 0.107688 0.093345 0.110304 0.095644 0.089828 0.084139 0.096727 0.090071 0.075516 0.137284
qa: -0.0474 -0.0461 -0.0439 -0.4181 0.7235 -0.3437 -0.3285 -0.3071 -0.3041 0.0459 0.0320 0.4482 -0.2481 -0.2349 -0.0761 -0.0170 -0.0527 0.1345 0.1031 0.1077 0.0933 0.1103 0.0956 0.0898 0.0841 0.0967 0.0901 0.0755 0.1373
va: 1.2618 1.2668 1.2779 2.0243 5.5199 2.1092 2.0951 2.1395 2.9970 3.8381 3.8489 3.8755 3.9423 3.9265 4.0632 3.9768 4.0270 4.2626 1.0004 0.9945 1.0057 0.9953 1.0069 1.0031 1.0125 1.0079 1.0036 1.0207 1.0100
dispcorr: -0.015074671 hartree
energy: -2750.393443501765
dipole: 41.46156 -40.77748 0.68408 -5.71587 7.12886 1.41299 7.80933 -5.63745 2.17187
magnitude: 2.67984 au
magnitude: 6.81161 debye
